BDBM50028829 CHEMBL18104::HEPTANAL::Heptaldehyde
SMILES: CCCCCCC=O
InChI Key: InChIKey=FXHGMKSSBGDXIY-UHFFFAOYSA-N
Data: 1 IC50
Activity Spreadsheet -- Enzyme Inhibition Constant Data from BindingDB
Found 1 hit for monomerid = 50028829
Trg + Lig
Ki
nM
ΔG°
kcal/mole
IC50
nM
Kd
nM
EC50/IC50
nM
koff
s-1
kon
M-1s-1
pHTemp
°C
Phenylethanolamine N-methyltransferase
(Bos taurus (bovine))
BDBM50028829
(CHEMBL18104 | HEPTANAL | Heptaldehyde)
Show SMILES CCCCCCC=O
Show InChI InChI=1S/C7H14O/c1-2-3-4-5-6-7-8/h7H,2-6H2,1H3
n/an/a 1.09E+5n/an/an/an/an/an/a
TBA
Curated by ChEMBL
Assay Description
Inhibitory activity against phenylethanolamine N-methyltransferase
J Med Chem 24: 7-12 (1981)
BindingDB Entry DOI: 10.7270/Q2PK0F59