BDBM50028836 2-Amino-1-cyclooct-1-enyl-ethanol::CHEMBL18481
SMILES: NCC(O)C1=C/CCCCCC\1
InChI Key: InChIKey=KWBPAVXOXCJZKV-RMKNXTFCSA-N
Data: 1 IC50
Activity Spreadsheet -- Enzyme Inhibition Constant Data from BindingDB
Found 1 hit for monomerid = 50028836
Trg + Lig
Ki
nM
ΔG°
kcal/mole
IC50
nM
Kd
nM
EC50/IC50
nM
koff
s-1
kon
M-1s-1
pHTemp
°C
Phenylethanolamine N-methyltransferase
(Bos taurus (bovine))
BDBM50028836
(2-Amino-1-cyclooct-1-enyl-ethanol | CHEMBL18481)
Show SMILES NCC(O)C1=C/CCCCCC\1 |t:4|
Show InChI InChI=1S/C10H19NO/c11-8-10(12)9-6-4-2-1-3-5-7-9/h6,10,12H,1-5,7-8,11H2/b9-6+
n/an/a 3.80E+4n/an/an/an/an/an/a
TBA
Curated by ChEMBL
Assay Description
Inhibitory activity against phenylethanolamine N-methyltransferase
J Med Chem 24: 7-12 (1981)
BindingDB Entry DOI: 10.7270/Q2PK0F59