BDBM50028875 CHEMBL3342716
SMILES: CC(C)C(=O)NCc1ccc(Cl)c(c1)-c1nc2cc(Cl)c(cc2c(=O)[nH]1)C1CC1
InChI Key: InChIKey=ZYBAZXUXBBDVRI-UHFFFAOYSA-N
Data: 1 IC50
Activity Spreadsheet -- Enzyme Inhibition Constant Data from BindingDB
Found 1 hit for monomerid = 50028875
Trg + Lig
Ki
nM
ΔG°
kcal/mole
IC50
nM
Kd
nM
EC50/IC50
nM
koff
s-1
kon
M-1s-1
pHTemp
°C
Prostaglandin E synthase
(Homo sapiens (Human))
BDBM50028875
(CHEMBL3342716)
Show SMILES CC(C)C(=O)NCc1ccc(Cl)c(c1)-c1nc2cc(Cl)c(cc2c(=O)[nH]1)C1CC1
Show InChI InChI=1S/C22H21Cl2N3O2/c1-11(2)21(28)25-10-12-3-6-17(23)15(7-12)20-26-19-9-18(24)14(13-4-5-13)8-16(19)22(29)27-20/h3,6-9,11,13H,4-5,10H2,1-2H3,(H,25,28)(H,26,27,29)
Reactome pathway
n/an/a 32n/an/an/an/an/an/a
Glenmark Pharmaceuticals Limited
Curated by ChEMBL
Assay Description
Inhibition of human mPGES-1 using PGH2 as substrate by RP-HPLC analysis
Bioorg Med Chem Lett 24: 4838-44 (2014)
Article DOI: 10.1016/j.bmcl.2014.08.056
BindingDB Entry DOI: 10.7270/Q2X068MN