null
SMILES: CC(=O)Nc1ccccc1Sc1cc(Cl)ccc1[N+]([O-])=O
InChI Key: InChIKey=LAFNJWWMXIXPJF-UHFFFAOYSA-N
Activity Spreadsheet -- Enzyme Inhibition Constant Data from BindingDB
Found 1 hit for monomerid = 50028896
Trg + Lig
Ki
nM
ΔG°
kcal/mole
IC50
nM
Kd
nM
EC50/IC50
nM
koff
s-1
kon
M-1s-1
pHTemp
°C
High affinity cAMP-specific 3',5'-cyclic phosphodiesterase 7A
(Homo sapiens (Human))
BDBM50028896
(CHEMBL3359093)
Show SMILES CC(=O)Nc1ccccc1Sc1cc(Cl)ccc1[N+]([O-])=O
Show InChI InChI=1S/C14H11ClN2O3S/c1-9(18)16-11-4-2-3-5-13(11)21-14-8-10(15)6-7-12(14)17(19)20/h2-8H,1H3,(H,16,18)
Reactome pathway
n/an/a 2.10E+3n/an/an/an/an/an/a
Centro de Investigaciones Biol�gicas (CSIC)
Curated by ChEMBL
Assay Description
Inhibition of human recombinant PDE7A1 assessed as inhibition of hydrolysis of [3H]cAMP after 20 mins by scintillation proximity assay
J Med Chem 57: 8590-607 (2014)
Article DOI: 10.1021/jm501090m
BindingDB Entry DOI: 10.7270/Q2S75HXC