BDBM50028921 CHEMBL3359107
SMILES: Nc1cccc(Sc2ccc(Cl)cc2[N+]([O-])=O)c1
InChI Key: InChIKey=WTOKGNGZVMEDKF-UHFFFAOYSA-N
Data: 1 IC50
Activity Spreadsheet -- Enzyme Inhibition Constant Data from BindingDB
Found 1 hit for monomerid = 50028921
Trg + Lig
Ki
nM
ΔG°
kcal/mole
IC50
nM
Kd
nM
EC50/IC50
nM
koff
s-1
kon
M-1s-1
pHTemp
°C
Phosphodiesterase 7
(Homo sapiens (Human))
BDBM50028921
(CHEMBL3359107)
Show SMILES Nc1cccc(Sc2ccc(Cl)cc2[N+]([O-])=O)c1
Show InChI InChI=1S/C12H9ClN2O2S/c13-8-4-5-12(11(6-8)15(16)17)18-10-3-1-2-9(14)7-10/h1-7H,14H2
Reactome pathway
n/an/a 5.69E+3n/an/an/an/an/an/a
Centro de Investigaciones Biol�gicas (CSIC)
Curated by ChEMBL
Assay Description
Inhibition of human recombinant PDE7A1 assessed as inhibition of hydrolysis of [3H]cAMP after 20 mins by scintillation proximity assay
J Med Chem 57: 8590-607 (2014)
Article DOI: 10.1021/jm501090m
BindingDB Entry DOI: 10.7270/Q2S75HXC