BDBM50029098 CHEMBL3361418
SMILES: NC(=N)NCC(=O)NCC1(CCN(Cc2ccccc2)CC1)Nc1cccc2ccccc12
InChI Key: InChIKey=BFVQVYYFEVEAPP-UHFFFAOYSA-N
Data: 5 KI  1 EC50
Activity Spreadsheet -- Enzyme Inhibition Constant Data from BindingDB
Found 6 hits for monomerid = 50029098
Trg + Lig
Ki
nM
ΔG°
kcal/mole
IC50
nM
Kd
nM
EC50/IC50
nM
koff
s-1
kon
M-1s-1
pHTemp
°C
Neuropeptide FF receptor 1
(Homo sapiens (Human))
BDBM50029098
(CHEMBL3361418)
Show SMILES NC(=N)NCC(=O)NCC1(CCN(Cc2ccccc2)CC1)Nc1cccc2ccccc12
Show InChI InChI=1S/C26H32N6O/c27-25(28)29-17-24(33)30-19-26(31-23-12-6-10-21-9-4-5-11-22(21)23)13-15-32(16-14-26)18-20-7-2-1-3-8-20/h1-12,31H,13-19H2,(H,30,33)(H4,27,28,29)
Reactome pathway
94n/an/an/an/an/an/an/an/a
The University of Mississippi
Curated by ChEMBL
Assay Description
Displacement of [3H]NPVF from human NPFF1 receptor expressed in CHO cells after 1 hr by liquid scintillation counting analysis
J Med Chem 57: 8903-27 (2014)
Article DOI: 10.1021/jm500989n
BindingDB Entry DOI: 10.7270/Q2C24Z18
NPFF2
(Homo sapiens (Human))
BDBM50029098
(CHEMBL3361418)
Show SMILES NC(=N)NCC(=O)NCC1(CCN(Cc2ccccc2)CC1)Nc1cccc2ccccc12
Show InChI InChI=1S/C26H32N6O/c27-25(28)29-17-24(33)30-19-26(31-23-12-6-10-21-9-4-5-11-22(21)23)13-15-32(16-14-26)18-20-7-2-1-3-8-20/h1-12,31H,13-19H2,(H,30,33)(H4,27,28,29)
309n/an/an/an/an/an/an/an/a
The University of Mississippi
Curated by ChEMBL
Assay Description
Displacement of [3H]EYF from human NPFF2 receptor expressed in CHO cells after 1 hr by liquid scintillation counting analysis
J Med Chem 57: 8903-27 (2014)
Article DOI: 10.1021/jm500989n
BindingDB Entry DOI: 10.7270/Q2C24Z18
Kappa-type opioid receptor
(Homo sapiens (Human))
BDBM50029098
(CHEMBL3361418)
Show SMILES NC(=N)NCC(=O)NCC1(CCN(Cc2ccccc2)CC1)Nc1cccc2ccccc12
Show InChI InChI=1S/C26H32N6O/c27-25(28)29-17-24(33)30-19-26(31-23-12-6-10-21-9-4-5-11-22(21)23)13-15-32(16-14-26)18-20-7-2-1-3-8-20/h1-12,31H,13-19H2,(H,30,33)(H4,27,28,29)
Reactome pathway
705n/an/an/an/an/an/an/an/a
The University of Mississippi
Curated by ChEMBL
Assay Description
Displacement of [3H]U-69593 from human KOR expressed in HEK293 cells after 60 mins by scintillation counting analysis
J Med Chem 57: 8903-27 (2014)
Article DOI: 10.1021/jm500989n
BindingDB Entry DOI: 10.7270/Q2C24Z18
Mu-type opioid receptor
(Homo sapiens (Human))
BDBM50029098
(CHEMBL3361418)
Show SMILES NC(=N)NCC(=O)NCC1(CCN(Cc2ccccc2)CC1)Nc1cccc2ccccc12
Show InChI InChI=1S/C26H32N6O/c27-25(28)29-17-24(33)30-19-26(31-23-12-6-10-21-9-4-5-11-22(21)23)13-15-32(16-14-26)18-20-7-2-1-3-8-20/h1-12,31H,13-19H2,(H,30,33)(H4,27,28,29)
NCI pathway
Reactome pathway
2.02E+3n/an/an/an/an/an/an/an/a
The University of Mississippi
Curated by ChEMBL
Assay Description
Displacement of [3H]DAMGO from human MOR expressed in HEK293 cells after 60 mins by scintillation counting analysis
J Med Chem 57: 8903-27 (2014)
Article DOI: 10.1021/jm500989n
BindingDB Entry DOI: 10.7270/Q2C24Z18
Delta-type opioid receptor
(Homo sapiens (Human))
BDBM50029098
(CHEMBL3361418)
Show SMILES NC(=N)NCC(=O)NCC1(CCN(Cc2ccccc2)CC1)Nc1cccc2ccccc12
Show InChI InChI=1S/C26H32N6O/c27-25(28)29-17-24(33)30-19-26(31-23-12-6-10-21-9-4-5-11-22(21)23)13-15-32(16-14-26)18-20-7-2-1-3-8-20/h1-12,31H,13-19H2,(H,30,33)(H4,27,28,29)
Reactome pathway
>5.00E+3n/an/an/an/an/an/an/an/a
The University of Mississippi
Curated by ChEMBL
Assay Description
Displacement of [3H]DPDPE from human DOR expressed in HEK293 cells after 60 mins by scintillation counting analysis
J Med Chem 57: 8903-27 (2014)
Article DOI: 10.1021/jm500989n
BindingDB Entry DOI: 10.7270/Q2C24Z18
Neuropeptide FF receptor 1
(Homo sapiens (Human))
BDBM50029098
(CHEMBL3361418)
Show SMILES NC(=N)NCC(=O)NCC1(CCN(Cc2ccccc2)CC1)Nc1cccc2ccccc12
Show InChI InChI=1S/C26H32N6O/c27-25(28)29-17-24(33)30-19-26(31-23-12-6-10-21-9-4-5-11-22(21)23)13-15-32(16-14-26)18-20-7-2-1-3-8-20/h1-12,31H,13-19H2,(H,30,33)(H4,27,28,29)
Reactome pathway
n/an/an/an/a>1.00E+4n/an/an/an/a
The University of Mississippi
Curated by ChEMBL
Assay Description
Agonist activity at human NPFF1 receptor expressed in CHO cells assessed as inhibition of forskolin-induced intracellular cAMP accumulation by liquid...
J Med Chem 57: 8903-27 (2014)
Article DOI: 10.1021/jm500989n
BindingDB Entry DOI: 10.7270/Q2C24Z18