BDBM50029154 5-Fluoro-3-piperidin-4-ylmethyl-1H-indole::CHEMBL278080
SMILES: Fc1ccc2[nH]cc(CC3CCNCC3)c2c1
InChI Key: InChIKey=FFWFFOAMLOOINZ-UHFFFAOYSA-N
Data: 6 IC50
Activity Spreadsheet -- Enzyme Inhibition Constant Data from BindingDB
Found 6 hits for monomerid = 50029154
Trg + Lig
Ki
nM
ΔG°
kcal/mole
IC50
nM
Kd
nM
EC50/IC50
nM
koff
s-1
kon
M-1s-1
pHTemp
°C
Sodium-dependent serotonin transporter
(Rattus norvegicus (rat))
BDBM50029154
(5-Fluoro-3-piperidin-4-ylmethyl-1H-indole | CHEMBL...)
Show SMILES Fc1ccc2[nH]cc(CC3CCNCC3)c2c1
Show InChI InChI=1S/C14H17FN2/c15-12-1-2-14-13(8-12)11(9-17-14)7-10-3-5-16-6-4-10/h1-2,8-10,16-17H,3-7H2
n/an/a 1.60n/an/an/an/an/an/a
Centre de Recherches de Vitry-Alfortville
Curated by ChEMBL
Assay Description
Inhibition of [3H]-peroxitine binding to rat cortical membranes as measure of inhibitory activity towards 5-HT uptake
J Med Chem 36: 1194-202 (1993)
BindingDB Entry DOI: 10.7270/Q2MC8Z3Z
D(2) dopamine receptor
(Rattus norvegicus (rat))
BDBM50029154
(5-Fluoro-3-piperidin-4-ylmethyl-1H-indole | CHEMBL...)
Show SMILES Fc1ccc2[nH]cc(CC3CCNCC3)c2c1
Show InChI InChI=1S/C14H17FN2/c15-12-1-2-14-13(8-12)11(9-17-14)7-10-3-5-16-6-4-10/h1-2,8-10,16-17H,3-7H2
Reactome pathway
n/an/a>100n/an/an/an/an/an/a
Centre de Recherches de Vitry-Alfortville
Curated by ChEMBL
Assay Description
Binding affinity at dopamine receptor D2 by the inhibition of binding to [3H]-spiperone in rat striatal membranes
J Med Chem 36: 1194-202 (1993)
BindingDB Entry DOI: 10.7270/Q2MC8Z3Z
Sodium-dependent serotonin transporter
(Rattus norvegicus (rat))
BDBM50029154
(5-Fluoro-3-piperidin-4-ylmethyl-1H-indole | CHEMBL...)
Show SMILES Fc1ccc2[nH]cc(CC3CCNCC3)c2c1
Show InChI InChI=1S/C14H17FN2/c15-12-1-2-14-13(8-12)11(9-17-14)7-10-3-5-16-6-4-10/h1-2,8-10,16-17H,3-7H2
n/an/a 100n/an/an/an/an/an/a
TBA
Curated by ChEMBL
Assay Description
Inhibition of uptake of 5-HT in rat brain cortex
J Med Chem 23: 1306-10 (1981)
BindingDB Entry DOI: 10.7270/Q2GT5NQD
Sodium-dependent dopamine transporter
(Rattus norvegicus (rat))
BDBM50029154
(5-Fluoro-3-piperidin-4-ylmethyl-1H-indole | CHEMBL...)
Show SMILES Fc1ccc2[nH]cc(CC3CCNCC3)c2c1
Show InChI InChI=1S/C14H17FN2/c15-12-1-2-14-13(8-12)11(9-17-14)7-10-3-5-16-6-4-10/h1-2,8-10,16-17H,3-7H2
Reactome pathway
n/an/a 7.00E+3n/an/an/an/an/an/a
TBA
Curated by ChEMBL
Assay Description
Inhibition of uptake of dopamine (DA) rat brain striatum
J Med Chem 23: 1306-10 (1981)
BindingDB Entry DOI: 10.7270/Q2GT5NQD
Sodium-dependent serotonin transporter
(Homo sapiens (Human))
BDBM50029154
(5-Fluoro-3-piperidin-4-ylmethyl-1H-indole | CHEMBL...)
Show SMILES Fc1ccc2[nH]cc(CC3CCNCC3)c2c1
Show InChI InChI=1S/C14H17FN2/c15-12-1-2-14-13(8-12)11(9-17-14)7-10-3-5-16-6-4-10/h1-2,8-10,16-17H,3-7H2
n/an/a 170n/an/an/an/an/an/a
TBA
Curated by ChEMBL
Assay Description
In vivo inhibition of uptake of 5-HT in human platelets
J Med Chem 23: 1306-10 (1981)
BindingDB Entry DOI: 10.7270/Q2GT5NQD
Norepinephrine Monoamine transporters
(Rattus norvegicus)
BDBM50029154
(5-Fluoro-3-piperidin-4-ylmethyl-1H-indole | CHEMBL...)
Show SMILES Fc1ccc2[nH]cc(CC3CCNCC3)c2c1
Show InChI InChI=1S/C14H17FN2/c15-12-1-2-14-13(8-12)11(9-17-14)7-10-3-5-16-6-4-10/h1-2,8-10,16-17H,3-7H2
Reactome pathway
n/an/a 1.00E+3n/an/an/an/an/an/a
TBA
Curated by ChEMBL
Assay Description
Inhibition of uptake of noradrenaline in rat brain hypothalamus
J Med Chem 23: 1306-10 (1981)
BindingDB Entry DOI: 10.7270/Q2GT5NQD