null
SMILES: CCC(=O)Nc1ccc(OCCCNC(C)C)c(Cc2ccccc2)c1
InChI Key: InChIKey=HWLIVMUCSVPXMX-UHFFFAOYSA-N
Activity Spreadsheet -- Enzyme Inhibition Constant Data from BindingDB
Found 1 hit for monomerid = 50029171
Trg + Lig
Ki
nM
ΔG°
kcal/mole
IC50
nM
Kd
nM
EC50/IC50
nM
koff
s-1
kon
M-1s-1
pHTemp
°C
Squalene synthase
(Rattus norvegicus)
BDBM50029171
(CHEMBL341371 | N-[3-Benzyl-4-(3-isopropylamino-pro...)
Show SMILES CCC(=O)Nc1ccc(OCCCNC(C)C)c(Cc2ccccc2)c1
Show InChI InChI=1S/C22H30N2O2/c1-4-22(25)24-20-11-12-21(26-14-8-13-23-17(2)3)19(16-20)15-18-9-6-5-7-10-18/h5-7,9-12,16-17,23H,4,8,13-15H2,1-3H3,(H,24,25)
Reactome pathway
n/an/a 0.600n/an/an/an/an/an/a
Zeneca Pharmaceuticals
Curated by ChEMBL
Assay Description
Inhibition of rat microsomal squalene synthase
J Med Chem 38: 4157-60 (1995)
BindingDB Entry DOI: 10.7270/Q21V5D0D