BDBM50029173 1-(Biphenyl-4-yloxy)-3-isopropylamino-propan-2-ol::CHEMBL263149
SMILES: CC(C)NCC(O)COc1ccc(cc1)-c1ccccc1
InChI Key: InChIKey=YBTGLLRMGKEQCC-UHFFFAOYSA-N
Data: 1 IC50
Activity Spreadsheet -- Enzyme Inhibition Constant Data from BindingDB
Found 1 hit for monomerid = 50029173
Trg + Lig
Ki
nM
ΔG°
kcal/mole
IC50
nM
Kd
nM
EC50/IC50
nM
koff
s-1
kon
M-1s-1
pHTemp
°C
Squalene synthetase
(Rattus norvegicus)
BDBM50029173
(1-(Biphenyl-4-yloxy)-3-isopropylamino-propan-2-ol ...)
Show SMILES CC(C)NCC(O)COc1ccc(cc1)-c1ccccc1
Show InChI InChI=1S/C18H23NO2/c1-14(2)19-12-17(20)13-21-18-10-8-16(9-11-18)15-6-4-3-5-7-15/h3-11,14,17,19-20H,12-13H2,1-2H3
Reactome pathway
n/an/a 3.00E+3n/an/an/an/an/an/a
Zeneca Pharmaceuticals
Curated by ChEMBL
Assay Description
Inhibition of rat microsomal squalene synthase
J Med Chem 38: 4157-60 (1995)
BindingDB Entry DOI: 10.7270/Q21V5D0D