null
SMILES: CCc1c(C)[n-]c(=[OH+])c(c1Sc1cc(C)cc(C)c1)[N+]([O-])=O
InChI Key: InChIKey=HRXHKHXJYOIYON-UHFFFAOYSA-N
Activity Spreadsheet -- Enzyme Inhibition Constant Data from BindingDB
Found 1 hit for monomerid = 50029665
Trg + Lig
Ki
nM
ΔG°
kcal/mole
IC50
nM
Kd
nM
EC50/IC50
nM
koff
s-1
kon
M-1s-1
pHTemp
°C
Reverse transcriptase/RNaseH
(Human immunodeficiency virus 1)
BDBM50029665
(4-(3,5-Dimethyl-phenylsulfanyl)-5-ethyl-6-methyl-3...)
Show SMILES CCc1c(C)[n-]c(=[OH+])c(c1Sc1cc(C)cc(C)c1)[N+]([O-])=O
Show InChI InChI=1S/C16H18N2O3S/c1-5-13-11(4)17-16(19)14(18(20)21)15(13)22-12-7-9(2)6-10(3)8-12/h6-8H,5H2,1-4H3,(H,17,19)
n/an/a 30n/an/an/an/an/an/a
URA 1387 CNRS
Curated by ChEMBL
Assay Description
Inhibition of HIV-1 reverse transcriptase(RT)
J Med Chem 38: 4679-86 (1995)
BindingDB Entry DOI: 10.7270/Q2QF8RWD