BDBM50029694 2-(4-sec-Butyl-1,1,3-trioxo-1,3-dihydro-1lambda*6*-benzo[d]isothiazol-2-ylmethoxy)-3-chloro-pyrido[1,2-a]pyrimidin-4-one::CHEMBL342725
SMILES: CCC(C)c1cccc2c1C(=O)N(COc1nc3ccccn3c(=O)c1Cl)S2(=O)=O
InChI Key: InChIKey=YIRKXGOOGNYHGW-UHFFFAOYSA-N
Data: 1 KI  1 Kon
Activity Spreadsheet -- Enzyme Inhibition Constant Data from BindingDB
Found 2 hits for monomerid = 50029694
Trg + Lig
Ki
nM
ΔG°
kcal/mole
IC50
nM
Kd
nM
EC50/IC50
nM
koff
s-1
kon
M-1s-1
pHTemp
°C
Neutrophil elastase
(Homo sapiens (Human))
BDBM50029694
(2-(4-sec-Butyl-1,1,3-trioxo-1,3-dihydro-1lambda*6*...)
Show SMILES CCC(C)c1cccc2c1C(=O)N(COc1nc3ccccn3c(=O)c1Cl)S2(=O)=O
Show InChI InChI=1S/C20H18ClN3O5S/c1-3-12(2)13-7-6-8-14-16(13)19(25)24(30(14,27)28)11-29-18-17(21)20(26)23-10-5-4-9-15(23)22-18/h4-10,12H,3,11H2,1-2H3
Reactome pathway
0.720n/an/an/an/an/an/an/an/a
Sterling Winthrop Pharmaceuticals Research Division
Curated by ChEMBL
Assay Description
Potency of inhibition of human leukocyte elastase is expressed as apparent binding constant
J Med Chem 38: 4687-92 (1995)
BindingDB Entry DOI: 10.7270/Q2KP816X
Neutrophil elastase
(Homo sapiens (Human))
BDBM50029694
(2-(4-sec-Butyl-1,1,3-trioxo-1,3-dihydro-1lambda*6*...)
Show SMILES CCC(C)c1cccc2c1C(=O)N(COc1nc3ccccn3c(=O)c1Cl)S2(=O)=O
Show InChI InChI=1S/C20H18ClN3O5S/c1-3-12(2)13-7-6-8-14-16(13)19(25)24(30(14,27)28)11-29-18-17(21)20(26)23-10-5-4-9-15(23)22-18/h4-10,12H,3,11H2,1-2H3
Reactome pathway
n/an/an/an/an/an/a 4.70E+3n/an/a
Sterling Winthrop Pharmaceuticals Research Division
Curated by ChEMBL
Assay Description
Potency of inhibition of human leukocyte elastase is expressed as apparent binding constant
J Med Chem 38: 4687-92 (1995)
BindingDB Entry DOI: 10.7270/Q2KP816X