BDBM50030196 CHEMBL3354065
SMILES: CCCCC1CCN(CCCN2C(=O)CCc3ccccc23)CC1
InChI Key: InChIKey=PHMGZAICAOYEAF-UHFFFAOYSA-N
Data: 16 KI  9 IC50  8 EC50
PDB links: 1 PDB ID matches this monomer.
Activity Spreadsheet -- Enzyme Inhibition Constant Data from BindingDB
Found 33 hits for monomerid = 50030196
Trg + Lig
Ki
nM
ΔG°
kcal/mole
IC50
nM
Kd
nM
EC50/IC50
nM
koff
s-1
kon
M-1s-1
pHTemp
°C
D(4) dopamine receptor
(Homo sapiens (Human))
BDBM50030196
(CHEMBL3354065)
Show SMILES CCCCC1CCN(CCCN2C(=O)CCc3ccccc23)CC1
Show InChI InChI=1S/C21H32N2O/c1-2-3-7-18-12-16-22(17-13-18)14-6-15-23-20-9-5-4-8-19(20)10-11-21(23)24/h4-5,8-9,18H,2-3,6-7,10-17H2,1H3
Reactome pathway
0.977n/an/an/an/an/an/an/an/a
Scuola di Scienze del Farmaco e dei Prodotti della Salute , Università di Camerino , Via S. Agostino 1 , 62032 Camerino , Italy.
Curated by ChEMBL
Assay Description
Displacement of [3H]N-methylspiperone from human dopamine D4 receptor expressed in HEK293 cell membranes after 1 hr by scintillation counting method
J Med Chem 61: 3712-3725 (2018)
Article DOI: 10.1021/acs.jmedchem.8b00265
BindingDB Entry DOI: 10.7270/Q20K2C2P
Sigma-1 receptor
(Cavia porcellus (Guinea pig))
BDBM50030196
(CHEMBL3354065)
Show SMILES CCCCC1CCN(CCCN2C(=O)CCc3ccccc23)CC1
Show InChI InChI=1S/C21H32N2O/c1-2-3-7-18-12-16-22(17-13-18)14-6-15-23-20-9-5-4-8-19(20)10-11-21(23)24/h4-5,8-9,18H,2-3,6-7,10-17H2,1H3
7.20n/an/an/an/an/an/an/an/a
Scuola di Scienze del Farmaco e dei Prodotti della Salute , Università di Camerino , Via S. Agostino 1 , 62032 Camerino , Italy.
Curated by ChEMBL
Assay Description
Displacement of [3H](+)-pentazocine from sigma1 receptor in Hartley guinea pig brain cortex after 120 mins by scintillation counting method
J Med Chem 61: 3712-3725 (2018)
Article DOI: 10.1021/acs.jmedchem.8b00265
BindingDB Entry DOI: 10.7270/Q20K2C2P
Muscarinic acetylcholine receptor M2
(Homo sapiens (Human))
BDBM50030196
(CHEMBL3354065)
Show SMILES CCCCC1CCN(CCCN2C(=O)CCc3ccccc23)CC1
Show InChI InChI=1S/C21H32N2O/c1-2-3-7-18-12-16-22(17-13-18)14-6-15-23-20-9-5-4-8-19(20)10-11-21(23)24/h4-5,8-9,18H,2-3,6-7,10-17H2,1H3
204n/an/an/an/an/an/an/an/a
Universit£ di Camerino
Curated by ChEMBL
Assay Description
Displacement of [3H]NMS from human M2 receptor expressed in CHO cells by microplate scintillation counting based radioligand binding assay
J Med Chem 57: 9065-77 (2014)
Article DOI: 10.1021/jm501173q
BindingDB Entry DOI: 10.7270/Q2FT8NNB
Muscarinic acetylcholine receptor M4
(Homo sapiens (Human))
BDBM50030196
(CHEMBL3354065)
Show SMILES CCCCC1CCN(CCCN2C(=O)CCc3ccccc23)CC1
Show InChI InChI=1S/C21H32N2O/c1-2-3-7-18-12-16-22(17-13-18)14-6-15-23-20-9-5-4-8-19(20)10-11-21(23)24/h4-5,8-9,18H,2-3,6-7,10-17H2,1H3
Reactome pathway
209n/an/an/an/an/an/an/an/a
Universit£ di Camerino
Curated by ChEMBL
Assay Description
Displacement of [3H]NMS from human M4 receptor expressed in CHO cells by microplate scintillation counting based radioligand binding assay
J Med Chem 57: 9065-77 (2014)
Article DOI: 10.1021/jm501173q
BindingDB Entry DOI: 10.7270/Q2FT8NNB
Muscarinic acetylcholine receptor M1
(Homo sapiens (Human))
BDBM50030196
(CHEMBL3354065)
Show SMILES CCCCC1CCN(CCCN2C(=O)CCc3ccccc23)CC1
Show InChI InChI=1S/C21H32N2O/c1-2-3-7-18-12-16-22(17-13-18)14-6-15-23-20-9-5-4-8-19(20)10-11-21(23)24/h4-5,8-9,18H,2-3,6-7,10-17H2,1H3
316n/an/an/an/an/an/an/an/a
Universit£ di Camerino
Curated by ChEMBL
Assay Description
Displacement of [3H]NMS from human M1 receptor expressed in CHO cells by microplate scintillation counting based radioligand binding assay
J Med Chem 57: 9065-77 (2014)
Article DOI: 10.1021/jm501173q
BindingDB Entry DOI: 10.7270/Q2FT8NNB
Alpha-1A adrenergic receptor
(Homo sapiens (Human))
BDBM50030196
(CHEMBL3354065)
Show SMILES CCCCC1CCN(CCCN2C(=O)CCc3ccccc23)CC1
Show InChI InChI=1S/C21H32N2O/c1-2-3-7-18-12-16-22(17-13-18)14-6-15-23-20-9-5-4-8-19(20)10-11-21(23)24/h4-5,8-9,18H,2-3,6-7,10-17H2,1H3
Reactome pathway
437n/an/an/an/an/an/an/an/a
Scuola di Scienze del Farmaco e dei Prodotti della Salute , Università di Camerino , Via S. Agostino 1 , 62032 Camerino , Italy.
Curated by ChEMBL
Assay Description
Displacement of [3H]prazosin from human recombinant alpha-1A adrenergic receptor expressed in CHO cell membranes after 30 mins by liquid scintillatio...
J Med Chem 61: 3712-3725 (2018)
Article DOI: 10.1021/acs.jmedchem.8b00265
BindingDB Entry DOI: 10.7270/Q20K2C2P
D(3) dopamine receptor
(Homo sapiens (Human))
BDBM50030196
(CHEMBL3354065)
Show SMILES CCCCC1CCN(CCCN2C(=O)CCc3ccccc23)CC1
Show InChI InChI=1S/C21H32N2O/c1-2-3-7-18-12-16-22(17-13-18)14-6-15-23-20-9-5-4-8-19(20)10-11-21(23)24/h4-5,8-9,18H,2-3,6-7,10-17H2,1H3
617n/an/an/an/an/an/an/an/a
Scuola di Scienze del Farmaco e dei Prodotti della Salute , Università di Camerino , Via S. Agostino 1 , 62032 Camerino , Italy.
Curated by ChEMBL
Assay Description
Displacement of [3H]N-methylspiperone from human dopamine D3 receptor expressed in HEK293 cell membranes after 1 hr by scintillation counting method
J Med Chem 61: 3712-3725 (2018)
Article DOI: 10.1021/acs.jmedchem.8b00265
BindingDB Entry DOI: 10.7270/Q20K2C2P
D(2) dopamine receptor
(Homo sapiens (Human))
BDBM50030196
(CHEMBL3354065)
Show SMILES CCCCC1CCN(CCCN2C(=O)CCc3ccccc23)CC1
Show InChI InChI=1S/C21H32N2O/c1-2-3-7-18-12-16-22(17-13-18)14-6-15-23-20-9-5-4-8-19(20)10-11-21(23)24/h4-5,8-9,18H,2-3,6-7,10-17H2,1H3
Reactome pathway
676n/an/an/an/an/an/an/an/a
Scuola di Scienze del Farmaco e dei Prodotti della Salute , Università di Camerino , Via S. Agostino 1 , 62032 Camerino , Italy.
Curated by ChEMBL
Assay Description
Displacement of [3H]N-methylspiperone from human dopamine D2 receptor expressed in HEK293 cell membranes after 1 hr by scintillation counting method
J Med Chem 61: 3712-3725 (2018)
Article DOI: 10.1021/acs.jmedchem.8b00265
BindingDB Entry DOI: 10.7270/Q20K2C2P
Adrenergic receptor alpha
(Homo sapiens (Human))
BDBM50030196
(CHEMBL3354065)
Show SMILES CCCCC1CCN(CCCN2C(=O)CCc3ccccc23)CC1
Show InChI InChI=1S/C21H32N2O/c1-2-3-7-18-12-16-22(17-13-18)14-6-15-23-20-9-5-4-8-19(20)10-11-21(23)24/h4-5,8-9,18H,2-3,6-7,10-17H2,1H3
776n/an/an/an/an/an/an/an/a
Scuola di Scienze del Farmaco e dei Prodotti della Salute , Università di Camerino , Via S. Agostino 1 , 62032 Camerino , Italy.
Curated by ChEMBL
Assay Description
Displacement of [3H]prazosin from human recombinant alpha-1B adrenergic receptor expressed in CHO cell membranes after 30 mins by liquid scintillatio...
J Med Chem 61: 3712-3725 (2018)
Article DOI: 10.1021/acs.jmedchem.8b00265
BindingDB Entry DOI: 10.7270/Q20K2C2P
Alpha adrenergic receptor (1a and 1d)
(Homo sapiens (Human))
BDBM50030196
(CHEMBL3354065)
Show SMILES CCCCC1CCN(CCCN2C(=O)CCc3ccccc23)CC1
Show InChI InChI=1S/C21H32N2O/c1-2-3-7-18-12-16-22(17-13-18)14-6-15-23-20-9-5-4-8-19(20)10-11-21(23)24/h4-5,8-9,18H,2-3,6-7,10-17H2,1H3
Reactome pathway
1.00E+3n/an/an/an/an/an/an/an/a
Scuola di Scienze del Farmaco e dei Prodotti della Salute , Università di Camerino , Via S. Agostino 1 , 62032 Camerino , Italy.
Curated by ChEMBL
Assay Description
Displacement of [3H]prazosin from human recombinant alpha-1D adrenergic receptor expressed in CHO cell membranes after 30 mins by liquid scintillatio...
J Med Chem 61: 3712-3725 (2018)
Article DOI: 10.1021/acs.jmedchem.8b00265
BindingDB Entry DOI: 10.7270/Q20K2C2P
Muscarinic acetylcholine receptor M3
(Homo sapiens (Human))
BDBM50030196
(CHEMBL3354065)
Show SMILES CCCCC1CCN(CCCN2C(=O)CCc3ccccc23)CC1
Show InChI InChI=1S/C21H32N2O/c1-2-3-7-18-12-16-22(17-13-18)14-6-15-23-20-9-5-4-8-19(20)10-11-21(23)24/h4-5,8-9,18H,2-3,6-7,10-17H2,1H3
Reactome pathway
1.20E+3n/an/an/an/an/an/an/an/a
Universit£ di Camerino
Curated by ChEMBL
Assay Description
Displacement of [3H]NMS from human M3 receptor expressed in CHO cells by microplate scintillation counting based radioligand binding assay
J Med Chem 57: 9065-77 (2014)
Article DOI: 10.1021/jm501173q
BindingDB Entry DOI: 10.7270/Q2FT8NNB
Sodium-dependent dopamine transporter
(Rattus norvegicus (rat))
BDBM50030196
(CHEMBL3354065)
Show SMILES CCCCC1CCN(CCCN2C(=O)CCc3ccccc23)CC1
Show InChI InChI=1S/C21H32N2O/c1-2-3-7-18-12-16-22(17-13-18)14-6-15-23-20-9-5-4-8-19(20)10-11-21(23)24/h4-5,8-9,18H,2-3,6-7,10-17H2,1H3
Reactome pathway
3.39E+3n/an/an/an/an/an/an/an/a
Scuola di Scienze del Farmaco e dei Prodotti della Salute , Università di Camerino , Via S. Agostino 1 , 62032 Camerino , Italy.
Curated by ChEMBL
Assay Description
Displacement of [3H]WIN 35,428 from DAT in Sprague-Dawley rat striatum after 120 mins by scintillation counting method
J Med Chem 61: 3712-3725 (2018)
Article DOI: 10.1021/acs.jmedchem.8b00265
BindingDB Entry DOI: 10.7270/Q20K2C2P
Muscarinic acetylcholine receptor M5
(Homo sapiens (Human))
BDBM50030196
(CHEMBL3354065)
Show SMILES CCCCC1CCN(CCCN2C(=O)CCc3ccccc23)CC1
Show InChI InChI=1S/C21H32N2O/c1-2-3-7-18-12-16-22(17-13-18)14-6-15-23-20-9-5-4-8-19(20)10-11-21(23)24/h4-5,8-9,18H,2-3,6-7,10-17H2,1H3
Reactome pathway
5.37E+3n/an/an/an/an/an/an/an/a
Universit£ di Camerino
Curated by ChEMBL
Assay Description
Displacement of [3H]NMS from human M5 receptor expressed in CHO cells by microplate scintillation counting based radioligand binding assay
J Med Chem 57: 9065-77 (2014)
Article DOI: 10.1021/jm501173q
BindingDB Entry DOI: 10.7270/Q2FT8NNB
Sodium-dependent serotonin transporter
(Rattus norvegicus (rat))
BDBM50030196
(CHEMBL3354065)
Show SMILES CCCCC1CCN(CCCN2C(=O)CCc3ccccc23)CC1
Show InChI InChI=1S/C21H32N2O/c1-2-3-7-18-12-16-22(17-13-18)14-6-15-23-20-9-5-4-8-19(20)10-11-21(23)24/h4-5,8-9,18H,2-3,6-7,10-17H2,1H3
8.91E+3n/an/an/an/an/an/an/an/a
Scuola di Scienze del Farmaco e dei Prodotti della Salute , Università di Camerino , Via S. Agostino 1 , 62032 Camerino , Italy.
Curated by ChEMBL
Assay Description
Displacement of [3H]-citalopram from SERT in Sprague-Dawley rat midbrain after 60 mins by scintillation counting method
J Med Chem 61: 3712-3725 (2018)
Article DOI: 10.1021/acs.jmedchem.8b00265
BindingDB Entry DOI: 10.7270/Q20K2C2P
Beta-2 adrenergic receptor
(Homo sapiens (Human))
BDBM50030196
(CHEMBL3354065)
Show SMILES CCCCC1CCN(CCCN2C(=O)CCc3ccccc23)CC1
Show InChI InChI=1S/C21H32N2O/c1-2-3-7-18-12-16-22(17-13-18)14-6-15-23-20-9-5-4-8-19(20)10-11-21(23)24/h4-5,8-9,18H,2-3,6-7,10-17H2,1H3
Reactome pathway
4.37E+4n/an/an/an/an/an/an/an/a
Scuola di Scienze del Farmaco e dei Prodotti della Salute , Università di Camerino , Via S. Agostino 1 , 62032 Camerino , Italy.
Curated by ChEMBL
Assay Description
Displacement of [3H]CGP12177 from human recombinant beta2 adrenergic receptor expressed in HEK293 cell membranes after 90 mins by beta counting metho...
J Med Chem 61: 3712-3725 (2018)
Article DOI: 10.1021/acs.jmedchem.8b00265
BindingDB Entry DOI: 10.7270/Q20K2C2P
Beta-1 adrenergic receptor
(Homo sapiens (Human))
BDBM50030196
(CHEMBL3354065)
Show SMILES CCCCC1CCN(CCCN2C(=O)CCc3ccccc23)CC1
Show InChI InChI=1S/C21H32N2O/c1-2-3-7-18-12-16-22(17-13-18)14-6-15-23-20-9-5-4-8-19(20)10-11-21(23)24/h4-5,8-9,18H,2-3,6-7,10-17H2,1H3
Reactome pathway
4.79E+4n/an/an/an/an/an/an/an/a
Scuola di Scienze del Farmaco e dei Prodotti della Salute , Università di Camerino , Via S. Agostino 1 , 62032 Camerino , Italy.
Curated by ChEMBL
Assay Description
Displacement of [3H]CGP12177 from human recombinant beta1 adrenergic receptor expressed in HEK293 cell membranes after 90 mins by beta counting metho...
J Med Chem 61: 3712-3725 (2018)
Article DOI: 10.1021/acs.jmedchem.8b00265
BindingDB Entry DOI: 10.7270/Q20K2C2P
D(4) dopamine receptor
(Homo sapiens (Human))
BDBM50030196
(CHEMBL3354065)
Show SMILES CCCCC1CCN(CCCN2C(=O)CCc3ccccc23)CC1
Show InChI InChI=1S/C21H32N2O/c1-2-3-7-18-12-16-22(17-13-18)14-6-15-23-20-9-5-4-8-19(20)10-11-21(23)24/h4-5,8-9,18H,2-3,6-7,10-17H2,1H3
Reactome pathway
n/an/a 6n/an/an/an/an/an/a
Scuola di Scienze del Farmaco e dei Prodotti della Salute , Università di Camerino , Via S. Agostino 1 , 62032 Camerino , Italy.
Curated by ChEMBL
Assay Description
Antagonist activity at human SP/Myc epitope-tagged dopamine D4 receptor expressed in HEK293T cells assessed as inhibition of dopamine-induced mVenus-...
J Med Chem 61: 3712-3725 (2018)
Article DOI: 10.1021/acs.jmedchem.8b00265
BindingDB Entry DOI: 10.7270/Q20K2C2P
Muscarinic acetylcholine receptor M1
(Homo sapiens (Human))
BDBM50030196
(CHEMBL3354065)
Show SMILES CCCCC1CCN(CCCN2C(=O)CCc3ccccc23)CC1
Show InChI InChI=1S/C21H32N2O/c1-2-3-7-18-12-16-22(17-13-18)14-6-15-23-20-9-5-4-8-19(20)10-11-21(23)24/h4-5,8-9,18H,2-3,6-7,10-17H2,1H3
n/an/an/an/a 102n/an/an/an/a
Universit£ di Camerino
Curated by ChEMBL
Assay Description
Agonist activity at human M1 receptor expressed in HEK293T cells by BRET based Gq protein activation assay
J Med Chem 57: 9065-77 (2014)
Article DOI: 10.1021/jm501173q
BindingDB Entry DOI: 10.7270/Q2FT8NNB
D(4) dopamine receptor
(Homo sapiens (Human))
BDBM50030196
(CHEMBL3354065)
Show SMILES CCCCC1CCN(CCCN2C(=O)CCc3ccccc23)CC1
Show InChI InChI=1S/C21H32N2O/c1-2-3-7-18-12-16-22(17-13-18)14-6-15-23-20-9-5-4-8-19(20)10-11-21(23)24/h4-5,8-9,18H,2-3,6-7,10-17H2,1H3
Reactome pathway
n/an/a 117n/an/an/an/an/an/a
Scuola di Scienze del Farmaco e dei Prodotti della Salute , Università di Camerino , Via S. Agostino 1 , 62032 Camerino , Italy.
Curated by ChEMBL
Assay Description
Antagonist activity at human SP/Myc epitope-tagged dopamine D4 receptor expressed in HEK293T cells assessed as inhibition of dopamine-induced RLuc8-f...
J Med Chem 61: 3712-3725 (2018)
Article DOI: 10.1021/acs.jmedchem.8b00265
BindingDB Entry DOI: 10.7270/Q20K2C2P
Muscarinic acetylcholine receptor M1
(Homo sapiens (Human))
BDBM50030196
(CHEMBL3354065)
Show SMILES CCCCC1CCN(CCCN2C(=O)CCc3ccccc23)CC1
Show InChI InChI=1S/C21H32N2O/c1-2-3-7-18-12-16-22(17-13-18)14-6-15-23-20-9-5-4-8-19(20)10-11-21(23)24/h4-5,8-9,18H,2-3,6-7,10-17H2,1H3
n/an/an/an/a 35n/an/an/an/a
Universit£ di Camerino
Curated by ChEMBL
Assay Description
Positive modulatory activity at human M1 receptor expressed in HEK293T cells assessed as effect on carbachol-induced response by BRET based Gq protei...
J Med Chem 57: 9065-77 (2014)
Article DOI: 10.1021/jm501173q
BindingDB Entry DOI: 10.7270/Q2FT8NNB
Muscarinic acetylcholine receptor M1
(Homo sapiens (Human))
BDBM50030196
(CHEMBL3354065)
Show SMILES CCCCC1CCN(CCCN2C(=O)CCc3ccccc23)CC1
Show InChI InChI=1S/C21H32N2O/c1-2-3-7-18-12-16-22(17-13-18)14-6-15-23-20-9-5-4-8-19(20)10-11-21(23)24/h4-5,8-9,18H,2-3,6-7,10-17H2,1H3
n/an/an/an/a 60n/an/an/an/a
Universit£ di Camerino
Curated by ChEMBL
Assay Description
Agonist activity at human M1 receptor expressed in HEK293T cells by BRET based Gq protein engagement assay
J Med Chem 57: 9065-77 (2014)
Article DOI: 10.1021/jm501173q
BindingDB Entry DOI: 10.7270/Q2FT8NNB
Muscarinic acetylcholine receptor M4
(Homo sapiens (Human))
BDBM50030196
(CHEMBL3354065)
Show SMILES CCCCC1CCN(CCCN2C(=O)CCc3ccccc23)CC1
Show InChI InChI=1S/C21H32N2O/c1-2-3-7-18-12-16-22(17-13-18)14-6-15-23-20-9-5-4-8-19(20)10-11-21(23)24/h4-5,8-9,18H,2-3,6-7,10-17H2,1H3
Reactome pathway
n/an/a 7.59E+3n/an/an/an/an/an/a
Universit£ di Camerino
Curated by ChEMBL
Assay Description
Antagonist activity at human M4 receptor expressed in HEK293T cells assessed as inhibition of xanomeline-induced response by beta-arrestin engagement...
J Med Chem 57: 9065-77 (2014)
Article DOI: 10.1021/jm501173q
BindingDB Entry DOI: 10.7270/Q2FT8NNB
Muscarinic acetylcholine receptor M4
(Homo sapiens (Human))
BDBM50030196
(CHEMBL3354065)
Show SMILES CCCCC1CCN(CCCN2C(=O)CCc3ccccc23)CC1
Show InChI InChI=1S/C21H32N2O/c1-2-3-7-18-12-16-22(17-13-18)14-6-15-23-20-9-5-4-8-19(20)10-11-21(23)24/h4-5,8-9,18H,2-3,6-7,10-17H2,1H3
Reactome pathway
n/an/a 178n/an/an/an/an/an/a
Universit£ di Camerino
Curated by ChEMBL
Assay Description
Antagonist activity at human M4 receptor expressed in HEK293T cells assessed as inhibition of carbachol-induced response by beta-arrestin engagement ...
J Med Chem 57: 9065-77 (2014)
Article DOI: 10.1021/jm501173q
BindingDB Entry DOI: 10.7270/Q2FT8NNB
Muscarinic acetylcholine receptor M4
(Homo sapiens (Human))
BDBM50030196
(CHEMBL3354065)
Show SMILES CCCCC1CCN(CCCN2C(=O)CCc3ccccc23)CC1
Show InChI InChI=1S/C21H32N2O/c1-2-3-7-18-12-16-22(17-13-18)14-6-15-23-20-9-5-4-8-19(20)10-11-21(23)24/h4-5,8-9,18H,2-3,6-7,10-17H2,1H3
Reactome pathway
n/an/a 4.79E+4n/an/an/an/an/an/a
Universit£ di Camerino
Curated by ChEMBL
Assay Description
Antagonist activity at human M4 receptor expressed in HEK293T cells assessed as inhibition of carbachol-induced response by BRET based Gq protein act...
J Med Chem 57: 9065-77 (2014)
Article DOI: 10.1021/jm501173q
BindingDB Entry DOI: 10.7270/Q2FT8NNB
Muscarinic acetylcholine receptor M4
(Homo sapiens (Human))
BDBM50030196
(CHEMBL3354065)
Show SMILES CCCCC1CCN(CCCN2C(=O)CCc3ccccc23)CC1
Show InChI InChI=1S/C21H32N2O/c1-2-3-7-18-12-16-22(17-13-18)14-6-15-23-20-9-5-4-8-19(20)10-11-21(23)24/h4-5,8-9,18H,2-3,6-7,10-17H2,1H3
Reactome pathway
n/an/an/an/a 275n/an/an/an/a
Universit£ di Camerino
Curated by ChEMBL
Assay Description
Agonist activity at human M4 receptor expressed in HEK293T cells by BRET based Gq protein activation assay
J Med Chem 57: 9065-77 (2014)
Article DOI: 10.1021/jm501173q
BindingDB Entry DOI: 10.7270/Q2FT8NNB
Muscarinic acetylcholine receptor M4
(Homo sapiens (Human))
BDBM50030196
(CHEMBL3354065)
Show SMILES CCCCC1CCN(CCCN2C(=O)CCc3ccccc23)CC1
Show InChI InChI=1S/C21H32N2O/c1-2-3-7-18-12-16-22(17-13-18)14-6-15-23-20-9-5-4-8-19(20)10-11-21(23)24/h4-5,8-9,18H,2-3,6-7,10-17H2,1H3
Reactome pathway
n/an/a 1.20E+5n/an/an/an/an/an/a
Universit£ di Camerino
Curated by ChEMBL
Assay Description
Antagonist activity at human M4 receptor expressed in HEK293T cells assessed as inhibition of xanomeline-induced response by BRET based Gq protein en...
J Med Chem 57: 9065-77 (2014)
Article DOI: 10.1021/jm501173q
BindingDB Entry DOI: 10.7270/Q2FT8NNB
Muscarinic acetylcholine receptor M4
(Homo sapiens (Human))
BDBM50030196
(CHEMBL3354065)
Show SMILES CCCCC1CCN(CCCN2C(=O)CCc3ccccc23)CC1
Show InChI InChI=1S/C21H32N2O/c1-2-3-7-18-12-16-22(17-13-18)14-6-15-23-20-9-5-4-8-19(20)10-11-21(23)24/h4-5,8-9,18H,2-3,6-7,10-17H2,1H3
Reactome pathway
n/an/a 2.24E+3n/an/an/an/an/an/a
Universit£ di Camerino
Curated by ChEMBL
Assay Description
Antagonist activity at human M4 receptor expressed in HEK293T cells assessed as inhibition of carbachol-induced response by BRET based Gq protein eng...
J Med Chem 57: 9065-77 (2014)
Article DOI: 10.1021/jm501173q
BindingDB Entry DOI: 10.7270/Q2FT8NNB
Muscarinic acetylcholine receptor M1
(Homo sapiens (Human))
BDBM50030196
(CHEMBL3354065)
Show SMILES CCCCC1CCN(CCCN2C(=O)CCc3ccccc23)CC1
Show InChI InChI=1S/C21H32N2O/c1-2-3-7-18-12-16-22(17-13-18)14-6-15-23-20-9-5-4-8-19(20)10-11-21(23)24/h4-5,8-9,18H,2-3,6-7,10-17H2,1H3
n/an/a 1.59E+3n/an/an/an/an/an/a
Universit£ di Camerino
Curated by ChEMBL
Assay Description
Antagonist activity at human M1 receptor expressed in HEK293T cells assessed as inhibition of xanomeline-induced response by BRET based beta-arrestin...
J Med Chem 57: 9065-77 (2014)
Article DOI: 10.1021/jm501173q
BindingDB Entry DOI: 10.7270/Q2FT8NNB
Muscarinic acetylcholine receptor M1
(Homo sapiens (Human))
BDBM50030196
(CHEMBL3354065)
Show SMILES CCCCC1CCN(CCCN2C(=O)CCc3ccccc23)CC1
Show InChI InChI=1S/C21H32N2O/c1-2-3-7-18-12-16-22(17-13-18)14-6-15-23-20-9-5-4-8-19(20)10-11-21(23)24/h4-5,8-9,18H,2-3,6-7,10-17H2,1H3
n/an/an/an/a 832n/an/an/an/a
Universit£ di Camerino
Curated by ChEMBL
Assay Description
Agonist activity at human M1 receptor expressed in HEK293T cells by BRET based beta-arrestin engagement assay
J Med Chem 57: 9065-77 (2014)
Article DOI: 10.1021/jm501173q
BindingDB Entry DOI: 10.7270/Q2FT8NNB
Muscarinic acetylcholine receptor M1
(Homo sapiens (Human))
BDBM50030196
(CHEMBL3354065)
Show SMILES CCCCC1CCN(CCCN2C(=O)CCc3ccccc23)CC1
Show InChI InChI=1S/C21H32N2O/c1-2-3-7-18-12-16-22(17-13-18)14-6-15-23-20-9-5-4-8-19(20)10-11-21(23)24/h4-5,8-9,18H,2-3,6-7,10-17H2,1H3
n/an/an/an/a 263n/an/an/an/a
Universit£ di Camerino
Curated by ChEMBL
Assay Description
Positive modulatory activity at human M1 receptor expressed in HEK293T cells assessed as effect on xanomeline-induced response by BRET based Gq prote...
J Med Chem 57: 9065-77 (2014)
Article DOI: 10.1021/jm501173q
BindingDB Entry DOI: 10.7270/Q2FT8NNB
Muscarinic acetylcholine receptor M1
(Homo sapiens (Human))
BDBM50030196
(CHEMBL3354065)
Show SMILES CCCCC1CCN(CCCN2C(=O)CCc3ccccc23)CC1
Show InChI InChI=1S/C21H32N2O/c1-2-3-7-18-12-16-22(17-13-18)14-6-15-23-20-9-5-4-8-19(20)10-11-21(23)24/h4-5,8-9,18H,2-3,6-7,10-17H2,1H3
n/an/an/an/a 191n/an/an/an/a
Universit£ di Camerino
Curated by ChEMBL
Assay Description
Positive modulatory activity at human M1 receptor expressed in HEK293T cells assessed as effect on carbachol-induced response by BRET based Gq protei...
J Med Chem 57: 9065-77 (2014)
Article DOI: 10.1021/jm501173q
BindingDB Entry DOI: 10.7270/Q2FT8NNB
Muscarinic acetylcholine receptor M1
(Homo sapiens (Human))
BDBM50030196
(CHEMBL3354065)
Show SMILES CCCCC1CCN(CCCN2C(=O)CCc3ccccc23)CC1
Show InChI InChI=1S/C21H32N2O/c1-2-3-7-18-12-16-22(17-13-18)14-6-15-23-20-9-5-4-8-19(20)10-11-21(23)24/h4-5,8-9,18H,2-3,6-7,10-17H2,1H3
n/an/a 174n/an/an/an/an/an/a
Universit£ di Camerino
Curated by ChEMBL
Assay Description
Antagonist activity at human M1 receptor expressed in HEK293T cells assessed as inhibition of carbachol-induced response by BRET based beta-arrestin ...
J Med Chem 57: 9065-77 (2014)
Article DOI: 10.1021/jm501173q
BindingDB Entry DOI: 10.7270/Q2FT8NNB
Muscarinic acetylcholine receptor M1
(Homo sapiens (Human))
BDBM50030196
(CHEMBL3354065)
Show SMILES CCCCC1CCN(CCCN2C(=O)CCc3ccccc23)CC1
Show InChI InChI=1S/C21H32N2O/c1-2-3-7-18-12-16-22(17-13-18)14-6-15-23-20-9-5-4-8-19(20)10-11-21(23)24/h4-5,8-9,18H,2-3,6-7,10-17H2,1H3
n/an/an/an/a 120n/an/an/an/a
Universit£ di Camerino
Curated by ChEMBL
Assay Description
Positive modulatory activity at human M1 receptor expressed in HEK293T cells assessed as effect on xanomeline-induced response by BRET based Gq prote...
J Med Chem 57: 9065-77 (2014)
Article DOI: 10.1021/jm501173q
BindingDB Entry DOI: 10.7270/Q2FT8NNB