BDBM50030204 (R)-4-Hydroxy-1-(1-methyl-1H-indole-3-carbonyl)-pyrrolidine-2-carboxylic acid [(R)-1-(benzyl-methyl-carbamoyl)-2-(4-hydroxy-phenyl)-ethyl]-amide::CHEMBL416864
SMILES: CN(Cc1ccccc1)C(=O)[C@@H](Cc1ccc(O)cc1)NC(=O)C1C[C@@H](O)CN1C(=O)c1cn(C)c2ccccc12
InChI Key: InChIKey=MNIPECDHAJEOJA-MPXLCVCVSA-N
Data: 1 IC50
Activity Spreadsheet -- Enzyme Inhibition Constant Data from BindingDB
Found 1 hit for monomerid = 50030204
Trg + Lig
Ki
nM
ΔG°
kcal/mole
IC50
nM
Kd
nM
EC50/IC50
nM
koff
s-1
kon
M-1s-1
pHTemp
°C
Neurokinin 1 receptor
(GUINEA PIG)
BDBM50030204
((R)-4-Hydroxy-1-(1-methyl-1H-indole-3-carbonyl)-py...)
Show SMILES CN(Cc1ccccc1)C(=O)[C@@H](Cc1ccc(O)cc1)NC(=O)C1C[C@@H](O)CN1C(=O)c1cn(C)c2ccccc12
Show InChI InChI=1S/C32H34N4O5/c1-34-20-26(25-10-6-7-11-28(25)34)31(40)36-19-24(38)17-29(36)30(39)33-27(16-21-12-14-23(37)15-13-21)32(41)35(2)18-22-8-4-3-5-9-22/h3-15,20,24,27,29,37-38H,16-19H2,1-2H3,(H,33,39)/t24-,27-,29?/m1/s1
n/an/a 1.80n/an/an/an/an/an/a
Fujisawa Pharmaceutical Co., Ltd.
Curated by ChEMBL
Assay Description
In vitro binding affinity against substance P receptor using [3H]SP as radioligand in guinea pig lung membrane
J Med Chem 37: 2090-9 (1994)
BindingDB Entry DOI: 10.7270/Q23779BT