null
SMILES: OS(=O)(=O)c1ccc2c(OC(=O)c3ccc(cc3)-c3ccc(cc3)C(=O)Oc3cc(cc4cc(ccc34)S(O)(=O)=O)S(O)(=O)=O)cc(cc2c1)S(O)(=O)=O
InChI Key: InChIKey=FMNBKUDRCXZAOF-UHFFFAOYSA-N
Activity Spreadsheet -- Enzyme Inhibition Constant Data from BindingDB
Found 3 hits for monomerid = 50030219
Trg + Lig
Ki
nM
ΔG°
kcal/mole
IC50
nM
Kd
nM
EC50/IC50
nM
koff
s-1
kon
M-1s-1
pHTemp
°C
Reverse transcriptase/RNaseH
(Human immunodeficiency virus 1)
BDBM50030219
(Biphenyl-4,4'-dicarboxylic acid bis-(3,6-disulfo-n...)
Show SMILES OS(=O)(=O)c1ccc2c(OC(=O)c3ccc(cc3)-c3ccc(cc3)C(=O)Oc3cc(cc4cc(ccc34)S(O)(=O)=O)S(O)(=O)=O)cc(cc2c1)S(O)(=O)=O
Show InChI InChI=1S/C34H22O16S4/c35-33(49-31-17-27(53(43,44)45)15-23-13-25(51(37,38)39)9-11-29(23)31)21-5-1-19(2-6-21)20-3-7-22(8-4-20)34(36)50-32-18-28(54(46,47)48)16-24-14-26(52(40,41)42)10-12-30(24)32/h1-18H,(H,37,38,39)(H,40,41,42)(H,43,44,45)(H,46,47,48)
n/an/a 1.44E+4n/an/an/an/an/an/a
College of Pharmacy
Curated by ChEMBL
Assay Description
The 50% inhibitory concentration was measured as inhibition of Ribonuclease H activity of reverse transcriptase
J Med Chem 37: 2513-9 (1994)
BindingDB Entry DOI: 10.7270/Q2HQ3XXX
Gag-Pol polyprotein [489-587]
(Human immunodeficiency virus type 1)
BDBM50030219
(Biphenyl-4,4'-dicarboxylic acid bis-(3,6-disulfo-n...)
Show SMILES OS(=O)(=O)c1ccc2c(OC(=O)c3ccc(cc3)-c3ccc(cc3)C(=O)Oc3cc(cc4cc(ccc34)S(O)(=O)=O)S(O)(=O)=O)cc(cc2c1)S(O)(=O)=O
Show InChI InChI=1S/C34H22O16S4/c35-33(49-31-17-27(53(43,44)45)15-23-13-25(51(37,38)39)9-11-29(23)31)21-5-1-19(2-6-21)20-3-7-22(8-4-20)34(36)50-32-18-28(54(46,47)48)16-24-14-26(52(40,41)42)10-12-30(24)32/h1-18H,(H,37,38,39)(H,40,41,42)(H,43,44,45)(H,46,47,48)
n/an/a 6.90E+3n/an/an/an/an/an/a
College of Pharmacy
Curated by ChEMBL
Assay Description
The 50% inhibitory concentration was measured as inhibition of DNA-dependent DNA polymerase activity
J Med Chem 37: 2513-9 (1994)
BindingDB Entry DOI: 10.7270/Q2HQ3XXX
Gag-Pol polyprotein [489-587]
(Human immunodeficiency virus type 1)
BDBM50030219
(Biphenyl-4,4'-dicarboxylic acid bis-(3,6-disulfo-n...)
Show SMILES OS(=O)(=O)c1ccc2c(OC(=O)c3ccc(cc3)-c3ccc(cc3)C(=O)Oc3cc(cc4cc(ccc34)S(O)(=O)=O)S(O)(=O)=O)cc(cc2c1)S(O)(=O)=O
Show InChI InChI=1S/C34H22O16S4/c35-33(49-31-17-27(53(43,44)45)15-23-13-25(51(37,38)39)9-11-29(23)31)21-5-1-19(2-6-21)20-3-7-22(8-4-20)34(36)50-32-18-28(54(46,47)48)16-24-14-26(52(40,41)42)10-12-30(24)32/h1-18H,(H,37,38,39)(H,40,41,42)(H,43,44,45)(H,46,47,48)
n/an/a 3.40E+3n/an/an/an/an/an/a
College of Pharmacy
Curated by ChEMBL
Assay Description
The 50% inhibitory concentration was measured as inhibition of RNA-dependent DNA polymerase activity
J Med Chem 37: 2513-9 (1994)
BindingDB Entry DOI: 10.7270/Q2HQ3XXX