BDBM50030340 CHEMBL3344203
SMILES: CCCCN1C[C@H](O)C(O)(CCO)[C@H](O)C1
InChI Key: InChIKey=SIJUCJGVFCTNAR-ZACCUICWSA-N
Data: 1 IC50
Activity Spreadsheet -- Enzyme Inhibition Constant Data from BindingDB
Found 1 hit for monomerid = 50030340
Trg + Lig
Ki
nM
ΔG°
kcal/mole
IC50
nM
Kd
nM
EC50/IC50
nM
koff
s-1
kon
M-1s-1
pHTemp
°C
Lysosomal alpha-mannosidase
(Homo sapiens (Human))
BDBM50030340
(CHEMBL3344203)
Show SMILES CCCCN1C[C@H](O)C(O)(CCO)[C@H](O)C1 |r|
Show InChI InChI=1S/C11H23NO4/c1-2-3-5-12-7-9(14)11(16,4-6-13)10(15)8-12/h9-10,13-16H,2-8H2,1H3/t9-,10+,11?
n/an/a 2.52E+5n/an/an/an/an/an/a
University of Pune
Curated by ChEMBL
Assay Description
Inhibition of alpha-mannosidase (unknown origin) using p-nitrophenyl-alpha-D-mannopyranoside substrate incubated for 10 mins by UV spectrophotometry
Bioorg Med Chem 22: 5776-82 (2014)
Article DOI: 10.1016/j.bmc.2014.09.034
BindingDB Entry DOI: 10.7270/Q2930VRN