BDBM50030350 4-Mercapto-2-[(S)-2-(2-phenoxy-acetylamino)-3-phenyl-propionylamino]-butyric acid::CHEMBL138798
SMILES: OC(=O)C(CCS)NC(=O)[C@H](Cc1ccccc1)NC(=O)COc1ccccc1
InChI Key: InChIKey=RSYIFQNOJNLNAN-ZVAWYAOSSA-N
Data: 1 IC50
Activity Spreadsheet -- Enzyme Inhibition Constant Data from BindingDB
Found 1 hit for monomerid = 50030350
Trg + Lig
Ki
nM
ΔG°
kcal/mole
IC50
nM
Kd
nM
EC50/IC50
nM
koff
s-1
kon
M-1s-1
pHTemp
°C
Peptidyl-glycine alpha-amidating monooxygenase
(Rattus norvegicus)
BDBM50030350
(4-Mercapto-2-[(S)-2-(2-phenoxy-acetylamino)-3-phen...)
Show SMILES OC(=O)C(CCS)NC(=O)[C@H](Cc1ccccc1)NC(=O)COc1ccccc1
Show InChI InChI=1S/C21H24N2O5S/c24-19(14-28-16-9-5-2-6-10-16)22-18(13-15-7-3-1-4-8-15)20(25)23-17(11-12-29)21(26)27/h1-10,17-18,29H,11-14H2,(H,22,24)(H,23,25)(H,26,27)/t17?,18-/m0/s1
n/an/a 14n/an/an/an/an/an/a
CIBA-GEIGY Corporation
Curated by ChEMBL
Assay Description
Inhibitory activity against peptidylglycine alpha-amidating monooxygenase (PAM) was determined
J Med Chem 37: 4430-7 (1995)
BindingDB Entry DOI: 10.7270/Q20R9NF9