BDBM50030370 CHEMBL139740::{(S)-2-[(R)-2-Amino-3-(4-hydroxy-phenyl)-propionylamino]-3-phenyl-propionylamino}-acetic acid
SMILES: N[C@H](Cc1ccc(O)cc1)C(=O)N[C@@H](Cc1ccccc1)C(=O)NCC(O)=O
InChI Key: InChIKey=OKDNSNWJEXAMSU-SJORKVTESA-N
Data: 1 IC50
Activity Spreadsheet -- Enzyme Inhibition Constant Data from BindingDB
Found 1 hit for monomerid = 50030370
Trg + Lig
Ki
nM
ΔG°
kcal/mole
IC50
nM
Kd
nM
EC50/IC50
nM
koff
s-1
kon
M-1s-1
pHTemp
°C
Peptidyl-glycine alpha-amidating monooxygenase
(Rattus norvegicus)
BDBM50030370
(CHEMBL139740 | {(S)-2-[(R)-2-Amino-3-(4-hydroxy-ph...)
Show SMILES N[C@H](Cc1ccc(O)cc1)C(=O)N[C@@H](Cc1ccccc1)C(=O)NCC(O)=O
Show InChI InChI=1S/C20H23N3O5/c21-16(10-14-6-8-15(24)9-7-14)19(27)23-17(20(28)22-12-18(25)26)11-13-4-2-1-3-5-13/h1-9,16-17,24H,10-12,21H2,(H,22,28)(H,23,27)(H,25,26)/t16-,17+/m1/s1
n/an/a>1.00E+4n/an/an/an/an/an/a
CIBA-GEIGY Corporation
Curated by ChEMBL
Assay Description
Inhibitory activity against peptidylglycine alpha-amidating monooxygenase (PAM) was determined
J Med Chem 37: 4430-7 (1995)
BindingDB Entry DOI: 10.7270/Q20R9NF9