BDBM50030466 CHEMBL3361439
SMILES: NC(=[NH2+])Nc1ccc(OC(=O)c2ccc(NC(N)=[NH2+])cc2)cc1
InChI Key: InChIKey=JXJBQAMLLCEHTI-UHFFFAOYSA-P
Data: 1 KI  1 IC50
Activity Spreadsheet -- Enzyme Inhibition Constant Data from BindingDB
Found 2 hits for monomerid = 50030466
Trg + Lig
Ki
nM
ΔG°
kcal/mole
IC50
nM
Kd
nM
EC50/IC50
nM
koff
s-1
kon
M-1s-1
pHTemp
°C
Genome polyprotein
(Dengue virus 2)
BDBM50030466
(CHEMBL3361439)
Show SMILES NC(=[NH2+])Nc1ccc(OC(=O)c2ccc(NC(N)=[NH2+])cc2)cc1
Show InChI InChI=1S/C15H16N6O2/c16-14(17)20-10-3-1-9(2-4-10)13(22)23-12-7-5-11(6-8-12)21-15(18)19/h1-8H,(H4,16,17,20)(H4,18,19,21)/p+2
2.00E+3n/an/an/an/an/an/an/an/a
University of KwaZulu-Natal
Curated by ChEMBL
Assay Description
Inhibition of dengue virus-2 NS2B-NS3 protease
Eur J Med Chem 87: 677-702 (2014)
Article DOI: 10.1016/j.ejmech.2014.10.010
BindingDB Entry DOI: 10.7270/Q2WW7K9C
Genome polyprotein
(Dengue virus 2)
BDBM50030466
(CHEMBL3361439)
Show SMILES NC(=[NH2+])Nc1ccc(OC(=O)c2ccc(NC(N)=[NH2+])cc2)cc1
Show InChI InChI=1S/C15H16N6O2/c16-14(17)20-10-3-1-9(2-4-10)13(22)23-12-7-5-11(6-8-12)21-15(18)19/h1-8H,(H4,16,17,20)(H4,18,19,21)/p+2
n/an/a 7.70E+3n/an/an/an/an/an/a
University of KwaZulu-Natal
Curated by ChEMBL
Assay Description
Inhibition of dengue virus-2 NS2B-NS3 protease
Eur J Med Chem 87: 677-702 (2014)
Article DOI: 10.1016/j.ejmech.2014.10.010
BindingDB Entry DOI: 10.7270/Q2WW7K9C