BDBM50030775 CHEMBL3342378
SMILES: CNC(=O)c1ccc(CNc2cc(nc(NC)n2)-c2ccccn2)cc1
InChI Key: InChIKey=PQLZKIZGFLHPNB-UHFFFAOYSA-N
Data: 2 EC50
Activity Spreadsheet -- Enzyme Inhibition Constant Data from BindingDB
Found 2 hits for monomerid = 50030775
Trg + Lig
Ki
nM
ΔG°
kcal/mole
IC50
nM
Kd
nM
EC50/IC50
nM
koff
s-1
kon
M-1s-1
pHTemp
°C
G-protein coupled receptor 39
(Mus musculus)
BDBM50030775
(CHEMBL3342378)
Show SMILES CNC(=O)c1ccc(CNc2cc(nc(NC)n2)-c2ccccn2)cc1
Show InChI InChI=1S/C19H20N6O/c1-20-18(26)14-8-6-13(7-9-14)12-23-17-11-16(24-19(21-2)25-17)15-5-3-4-10-22-15/h3-11H,12H2,1-2H3,(H,20,26)(H2,21,23,24,25)
n/an/an/an/a 8n/an/an/an/a
Novartis Institutes for BioMedical Research
Curated by ChEMBL
Assay Description
Agonist activity at mouse GPR39 expressed in HEK293 cells by IP1 assay
ACS Med Chem Lett 5: 1114-8 (2014)
Article DOI: 10.1021/ml500240d
BindingDB Entry DOI: 10.7270/Q2MC91MW
G-protein coupled receptor 39
(Homo sapiens (Human))
BDBM50030775
(CHEMBL3342378)
Show SMILES CNC(=O)c1ccc(CNc2cc(nc(NC)n2)-c2ccccn2)cc1
Show InChI InChI=1S/C19H20N6O/c1-20-18(26)14-8-6-13(7-9-14)12-23-17-11-16(24-19(21-2)25-17)15-5-3-4-10-22-15/h3-11H,12H2,1-2H3,(H,20,26)(H2,21,23,24,25)
Reactome pathway
n/an/an/an/a 30n/an/an/an/a
Novartis Institutes for BioMedical Research
Curated by ChEMBL
Assay Description
Agonist activity at human GPR39 expressed in HEK293 cells by IP1 assay
ACS Med Chem Lett 5: 1114-8 (2014)
Article DOI: 10.1021/ml500240d
BindingDB Entry DOI: 10.7270/Q2MC91MW