BDBM50030785 CHEMBL3342368
SMILES: CNc1nc(NCc2ccncc2)cc(n1)-c1ccccn1
InChI Key: InChIKey=PZFFKFAUQFEDHR-UHFFFAOYSA-N
Data: 2 EC50
Activity Spreadsheet -- Enzyme Inhibition Constant Data from BindingDB
Found 2 hits for monomerid = 50030785
Trg + Lig
Ki
nM
ΔG°
kcal/mole
IC50
nM
Kd
nM
EC50/IC50
nM
koff
s-1
kon
M-1s-1
pHTemp
°C
G-protein coupled receptor 39
(Mus musculus)
BDBM50030785
(CHEMBL3342368)
Show SMILES CNc1nc(NCc2ccncc2)cc(n1)-c1ccccn1
Show InChI InChI=1S/C16H16N6/c1-17-16-21-14(13-4-2-3-7-19-13)10-15(22-16)20-11-12-5-8-18-9-6-12/h2-10H,11H2,1H3,(H2,17,20,21,22)
n/an/an/an/a 304n/an/an/an/a
Novartis Institutes for BioMedical Research
Curated by ChEMBL
Assay Description
Agonist activity at mouse GPR39 expressed in HEK293 cells by IP1 assay
ACS Med Chem Lett 5: 1114-8 (2014)
Article DOI: 10.1021/ml500240d
BindingDB Entry DOI: 10.7270/Q2MC91MW
G-protein coupled receptor 39
(Homo sapiens (Human))
BDBM50030785
(CHEMBL3342368)
Show SMILES CNc1nc(NCc2ccncc2)cc(n1)-c1ccccn1
Show InChI InChI=1S/C16H16N6/c1-17-16-21-14(13-4-2-3-7-19-13)10-15(22-16)20-11-12-5-8-18-9-6-12/h2-10H,11H2,1H3,(H2,17,20,21,22)
Reactome pathway
n/an/an/an/a 87n/an/an/an/a
Novartis Institutes for BioMedical Research
Curated by ChEMBL
Assay Description
Agonist activity at human GPR39 expressed in HEK293 cells by IP1 assay
ACS Med Chem Lett 5: 1114-8 (2014)
Article DOI: 10.1021/ml500240d
BindingDB Entry DOI: 10.7270/Q2MC91MW