BDBM50030897 CHEMBL3356568
SMILES: Cc1noc(C)c1-c1ccc(cc1F)-c1nc2cnccn2c1NC(C)(C)C
InChI Key: InChIKey=SGIWWXKRVKXAFK-UHFFFAOYSA-N
Data: 1 IC50
Activity Spreadsheet -- Enzyme Inhibition Constant Data from BindingDB
Found 1 hit for monomerid = 50030897
Trg + Lig
Ki
nM
ΔG°
kcal/mole
IC50
nM
Kd
nM
EC50/IC50
nM
koff
s-1
kon
M-1s-1
pHTemp
°C
Bromodomain-containing protein 4
(Homo sapiens (Human))
BDBM50030897
(CHEMBL3356568)
Show SMILES Cc1noc(C)c1-c1ccc(cc1F)-c1nc2cnccn2c1NC(C)(C)C |(7.65,-53.99,;7.17,-55.45,;5.7,-55.93,;5.7,-57.47,;7.17,-57.95,;7.65,-59.41,;8.08,-56.7,;9.62,-56.7,;10.39,-55.36,;11.93,-55.36,;12.7,-56.7,;11.93,-58.03,;10.39,-58.03,;9.62,-59.36,;14.24,-56.7,;15.14,-57.95,;16.61,-57.47,;17.94,-58.24,;19.27,-57.47,;19.27,-55.93,;17.94,-55.16,;16.61,-55.93,;15.14,-55.45,;14.66,-53.99,;15.7,-52.84,;15.29,-51.36,;16.73,-51.7,;17.18,-53.24,)|
Show InChI InChI=1S/C21H22FN5O/c1-12-18(13(2)28-26-12)15-7-6-14(10-16(15)22)19-20(25-21(3,4)5)27-9-8-23-11-17(27)24-19/h6-11,25H,1-5H3
n/an/a 1.30E+4n/an/an/an/an/an/a
Dana-Farber Institute
Curated by ChEMBL
Assay Description
Inhibition of BRD4 (unknown origin) by biotinylated-JQ1 based AlphaScreen BRD binding assay
J Med Chem 57: 9019-27 (2014)
Article DOI: 10.1021/jm501120z
BindingDB Entry DOI: 10.7270/Q2FN17T7