BDBM50030902 CHEMBL3356563
SMILES: Cc1noc(C)c1-c1ccc(cc1)-c1nc2ccc(cn2c1NC(C)(C)C)C(O)=O
InChI Key: InChIKey=CMLDKOAVOHETFN-UHFFFAOYSA-N
Data: 1 IC50
Activity Spreadsheet -- Enzyme Inhibition Constant Data from BindingDB
Found 1 hit for monomerid = 50030902
Trg + Lig
Ki
nM
ΔG°
kcal/mole
IC50
nM
Kd
nM
EC50/IC50
nM
koff
s-1
kon
M-1s-1
pHTemp
°C
Bromodomain-containing protein 4
(Homo sapiens (Human))
BDBM50030902
(CHEMBL3356563)
Show SMILES Cc1noc(C)c1-c1ccc(cc1)-c1nc2ccc(cn2c1NC(C)(C)C)C(O)=O
Show InChI InChI=1S/C23H24N4O3/c1-13-19(14(2)30-26-13)15-6-8-16(9-7-15)20-21(25-23(3,4)5)27-12-17(22(28)29)10-11-18(27)24-20/h6-12,25H,1-5H3,(H,28,29)
n/an/a 968n/an/an/an/an/an/a
Dana-Farber Institute
Curated by ChEMBL
Assay Description
Inhibition of BRD4 (unknown origin) by biotinylated-JQ1 based AlphaScreen BRD binding assay
J Med Chem 57: 9019-27 (2014)
Article DOI: 10.1021/jm501120z
BindingDB Entry DOI: 10.7270/Q2FN17T7