BDBM50030917 CHEMBL3356550
SMILES: COc1ccc(Nc2c(nc3cc(OC)ncn23)-c2ccc(cc2)-c2c(C)noc2C)cc1
InChI Key: InChIKey=BHDYFGFFEITRNU-UHFFFAOYSA-N
Data: 1 IC50
Activity Spreadsheet -- Enzyme Inhibition Constant Data from BindingDB
Found 1 hit for monomerid = 50030917
Trg + Lig
Ki
nM
ΔG°
kcal/mole
IC50
nM
Kd
nM
EC50/IC50
nM
koff
s-1
kon
M-1s-1
pHTemp
°C
Bromodomain-containing protein 4
(Homo sapiens (Human))
BDBM50030917
(CHEMBL3356550)
Show SMILES COc1ccc(Nc2c(nc3cc(OC)ncn23)-c2ccc(cc2)-c2c(C)noc2C)cc1
Show InChI InChI=1S/C25H23N5O3/c1-15-23(16(2)33-29-15)17-5-7-18(8-6-17)24-25(27-19-9-11-20(31-3)12-10-19)30-14-26-22(32-4)13-21(30)28-24/h5-14,27H,1-4H3
n/an/a 2.89E+3n/an/an/an/an/an/a
Dana-Farber Institute
Curated by ChEMBL
Assay Description
Inhibition of BRD4 (unknown origin) by biotinylated-JQ1 based AlphaScreen BRD binding assay
J Med Chem 57: 9019-27 (2014)
Article DOI: 10.1021/jm501120z
BindingDB Entry DOI: 10.7270/Q2FN17T7