BDBM50030923 CHEMBL3356544
SMILES: Cc1noc(C)c1-c1ccc(cc1)-c1nc2ccc(C)cn2c1NCc1ccccc1
InChI Key: InChIKey=KKSVRZKAQJSMDT-UHFFFAOYSA-N
Data: 1 IC50
Activity Spreadsheet -- Enzyme Inhibition Constant Data from BindingDB
Found 1 hit for monomerid = 50030923
Trg + Lig
Ki
nM
ΔG°
kcal/mole
IC50
nM
Kd
nM
EC50/IC50
nM
koff
s-1
kon
M-1s-1
pHTemp
°C
Bromodomain-containing protein 4
(Homo sapiens (Human))
BDBM50030923
(CHEMBL3356544)
Show SMILES Cc1noc(C)c1-c1ccc(cc1)-c1nc2ccc(C)cn2c1NCc1ccccc1
Show InChI InChI=1S/C26H24N4O/c1-17-9-14-23-28-25(26(30(23)16-17)27-15-20-7-5-4-6-8-20)22-12-10-21(11-13-22)24-18(2)29-31-19(24)3/h4-14,16,27H,15H2,1-3H3
n/an/a>1.00E+5n/an/an/an/an/an/a
Dana-Farber Institute
Curated by ChEMBL
Assay Description
Inhibition of BRD4 (unknown origin) by biotinylated-JQ1 based AlphaScreen BRD binding assay
J Med Chem 57: 9019-27 (2014)
Article DOI: 10.1021/jm501120z
BindingDB Entry DOI: 10.7270/Q2FN17T7