BDBM50030926 CHEMBL3356541
SMILES: Cc1noc(C)c1-c1cccc(c1)C1Nc2ccccc2NC2=C1C(=O)OC2
InChI Key: InChIKey=RFMUVQXFILOQCW-UHFFFAOYSA-N
Data: 1 IC50
Activity Spreadsheet -- Enzyme Inhibition Constant Data from BindingDB
Found 1 hit for monomerid = 50030926
Trg + Lig
Ki
nM
ΔG°
kcal/mole
IC50
nM
Kd
nM
EC50/IC50
nM
koff
s-1
kon
M-1s-1
pHTemp
°C
Bromodomain-containing protein 4
(Homo sapiens (Human))
BDBM50030926
(CHEMBL3356541)
Show SMILES Cc1noc(C)c1-c1cccc(c1)C1Nc2ccccc2NC2=C1C(=O)OC2 |c:25|
Show InChI InChI=1S/C22H19N3O3/c1-12-19(13(2)28-25-12)14-6-5-7-15(10-14)21-20-18(11-27-22(20)26)23-16-8-3-4-9-17(16)24-21/h3-10,21,23-24H,11H2,1-2H3
n/an/a 2.05E+3n/an/an/an/an/an/a
Dana-Farber Institute
Curated by ChEMBL
Assay Description
Inhibition of BRD4 (unknown origin) by biotinylated-JQ1 based AlphaScreen BRD binding assay
J Med Chem 57: 9019-27 (2014)
Article DOI: 10.1021/jm501120z
BindingDB Entry DOI: 10.7270/Q2FN17T7