BDBM50031684 CHEMBL3360302
SMILES: CC(C)[C@H](NC(=O)[C@H](C)NC(=O)[C@@H](NC(=O)c1cccc2ccccc12)C(C)(C)C)C(=O)C(=O)NCc1ccc(cc1)S(N)(=O)=O
InChI Key: InChIKey=KMPBNLSKMODTGI-IYKJZBSOSA-N
Data: 2 IC50
Activity Spreadsheet -- Enzyme Inhibition Constant Data from BindingDB
Found 2 hits for monomerid = 50031684
Trg + Lig
Ki
nM
ΔG°
kcal/mole
IC50
nM
Kd
nM
EC50/IC50
nM
koff
s-1
kon
M-1s-1
pHTemp
°C
Cathepsin B
(Homo sapiens (Human))
BDBM50031684
(CHEMBL3360302)
Show SMILES CC(C)[C@H](NC(=O)[C@H](C)NC(=O)[C@@H](NC(=O)c1cccc2ccccc12)C(C)(C)C)C(=O)C(=O)NCc1ccc(cc1)S(N)(=O)=O |r|
Show InChI InChI=1S/C33H41N5O7S/c1-19(2)26(27(39)31(42)35-18-21-14-16-23(17-15-21)46(34,44)45)37-29(40)20(3)36-32(43)28(33(4,5)6)38-30(41)25-13-9-11-22-10-7-8-12-24(22)25/h7-17,19-20,26,28H,18H2,1-6H3,(H,35,42)(H,36,43)(H,37,40)(H,38,41)(H2,34,44,45)/t20-,26-,28+/m0/s1
Reactome pathway
n/an/a 532n/an/an/an/an/an/a
Domainex Ltd.
Curated by ChEMBL
Assay Description
Inhibition of human liver cathepsin B using ABz-Gly-Ile-Val-Arg-Ala-Lys-DNP-OH as substrate after 10 mins by fluorescence assay
J Med Chem 57: 9447-62 (2014)
Article DOI: 10.1021/jm501102h
BindingDB Entry DOI: 10.7270/Q2R212ZW
Peptidase 1 (Der p 1)
(Dermatophagoides pteronyssinus (European house dus...)
BDBM50031684
(CHEMBL3360302)
Show SMILES CC(C)[C@H](NC(=O)[C@H](C)NC(=O)[C@@H](NC(=O)c1cccc2ccccc12)C(C)(C)C)C(=O)C(=O)NCc1ccc(cc1)S(N)(=O)=O |r|
Show InChI InChI=1S/C33H41N5O7S/c1-19(2)26(27(39)31(42)35-18-21-14-16-23(17-15-21)46(34,44)45)37-29(40)20(3)36-32(43)28(33(4,5)6)38-30(41)25-13-9-11-22-10-7-8-12-24(22)25/h7-17,19-20,26,28H,18H2,1-6H3,(H,35,42)(H,36,43)(H,37,40)(H,38,41)(H2,34,44,45)/t20-,26-,28+/m0/s1
n/an/a 4n/an/an/an/an/an/a
Domainex Ltd.
Curated by ChEMBL
Assay Description
Inhibition of house dust mite Derp-1 after 20 mins
J Med Chem 57: 9447-62 (2014)
Article DOI: 10.1021/jm501102h
BindingDB Entry DOI: 10.7270/Q2R212ZW