null
SMILES: CCOc1ccc(cc1)-c1cncc2nc(NC(=O)C3CC3)nn12
InChI Key: InChIKey=OAEUCRPDDJBSHT-UHFFFAOYSA-N
Activity Spreadsheet -- Enzyme Inhibition Constant Data from BindingDB
Found 1 hit for monomerid = 50031741
Trg + Lig
Ki
nM
ΔG°
kcal/mole
IC50
nM
Kd
nM
EC50/IC50
nM
koff
s-1
kon
M-1s-1
pHTemp
°C
Tyrosine-protein kinase JAK1
(Homo sapiens (Human))
BDBM50031741
(CHEMBL3360347)
Show SMILES CCOc1ccc(cc1)-c1cncc2nc(NC(=O)C3CC3)nn12
Show InChI InChI=1S/C17H17N5O2/c1-2-24-13-7-5-11(6-8-13)14-9-18-10-15-19-17(21-22(14)15)20-16(23)12-3-4-12/h5-10,12H,2-4H2,1H3,(H,20,21,23)
Reactome pathway
n/an/a 3.10E+3n/an/an/an/an/an/a
Galapagos NV
Curated by ChEMBL
Assay Description
Inhibition of human recombinant JAK1
J Med Chem 57: 9323-42 (2014)
Article DOI: 10.1021/jm501262q
BindingDB Entry DOI: 10.7270/Q2GH9KK6