BDBM50031749 CHEMBL3360320
SMILES: COc1ccc(cc1)-c1cccc2nc(nn12)N(C)C
InChI Key: InChIKey=QUPSGGJCHCSDGG-UHFFFAOYSA-N
Data: 1 IC50
Activity Spreadsheet -- Enzyme Inhibition Constant Data from BindingDB
Found 1 hit for monomerid = 50031749
Trg + Lig
Ki
nM
ΔG°
kcal/mole
IC50
nM
Kd
nM
EC50/IC50
nM
koff
s-1
kon
M-1s-1
pHTemp
°C
Tyrosine-protein kinase JAK1
(Homo sapiens (Human))
BDBM50031749
(CHEMBL3360320)
Show SMILES COc1ccc(cc1)-c1cccc2nc(nn12)N(C)C
Show InChI InChI=1S/C15H16N4O/c1-18(2)15-16-14-6-4-5-13(19(14)17-15)11-7-9-12(20-3)10-8-11/h4-10H,1-3H3
Reactome pathway
n/an/a>1.00E+4n/an/an/an/an/an/a
Galapagos NV
Curated by ChEMBL
Assay Description
Inhibition of human recombinant JAK1
J Med Chem 57: 9323-42 (2014)
Article DOI: 10.1021/jm501262q
BindingDB Entry DOI: 10.7270/Q2GH9KK6