BDBM50031751 CHEMBL3360322
SMILES: COc1ccc(cc1)-c1cccc2nc(nn12)N(C)C(=O)C1CC1
InChI Key: InChIKey=MHZQSFYEHHVFDN-UHFFFAOYSA-N
Data: 1 IC50
Activity Spreadsheet -- Enzyme Inhibition Constant Data from BindingDB
Found 1 hit for monomerid = 50031751
Trg + Lig
Ki
nM
ΔG°
kcal/mole
IC50
nM
Kd
nM
EC50/IC50
nM
koff
s-1
kon
M-1s-1
pHTemp
°C
Tyrosine-protein kinase JAK1
(Homo sapiens (Human))
BDBM50031751
(CHEMBL3360322)
Show SMILES COc1ccc(cc1)-c1cccc2nc(nn12)N(C)C(=O)C1CC1
Show InChI InChI=1S/C18H18N4O2/c1-21(17(23)13-6-7-13)18-19-16-5-3-4-15(22(16)20-18)12-8-10-14(24-2)11-9-12/h3-5,8-11,13H,6-7H2,1-2H3
Reactome pathway
n/an/a>1.00E+4n/an/an/an/an/an/a
Galapagos NV
Curated by ChEMBL
Assay Description
Inhibition of human recombinant JAK1
J Med Chem 57: 9323-42 (2014)
Article DOI: 10.1021/jm501262q
BindingDB Entry DOI: 10.7270/Q2GH9KK6