BDBM50031753 CHEMBL3360323
SMILES: COc1ccc(cc1)-c1cccc2nc(NC(=O)C(C)C)nn12
InChI Key: InChIKey=AMZZYDWABRUTDR-UHFFFAOYSA-N
Data: 1 IC50
Activity Spreadsheet -- Enzyme Inhibition Constant Data from BindingDB
Found 1 hit for monomerid = 50031753
Trg + Lig
Ki
nM
ΔG°
kcal/mole
IC50
nM
Kd
nM
EC50/IC50
nM
koff
s-1
kon
M-1s-1
pHTemp
°C
Tyrosine-protein kinase JAK1
(Homo sapiens (Human))
BDBM50031753
(CHEMBL3360323)
Show SMILES COc1ccc(cc1)-c1cccc2nc(NC(=O)C(C)C)nn12
Show InChI InChI=1S/C17H18N4O2/c1-11(2)16(22)19-17-18-15-6-4-5-14(21(15)20-17)12-7-9-13(23-3)10-8-12/h4-11H,1-3H3,(H,19,20,22)
Reactome pathway
n/an/a>1.00E+4n/an/an/an/an/an/a
Galapagos NV
Curated by ChEMBL
Assay Description
Inhibition of human recombinant JAK1
J Med Chem 57: 9323-42 (2014)
Article DOI: 10.1021/jm501262q
BindingDB Entry DOI: 10.7270/Q2GH9KK6