BDBM50031754 CHEMBL3360324
SMILES: COc1ccc(cc1)-c1cccc2nc(NC(C)=O)nn12
InChI Key: InChIKey=XOWJHOYWSTZXPY-UHFFFAOYSA-N
Data: 1 IC50
Activity Spreadsheet -- Enzyme Inhibition Constant Data from BindingDB
Found 1 hit for monomerid = 50031754
Trg + Lig
Ki
nM
ΔG°
kcal/mole
IC50
nM
Kd
nM
EC50/IC50
nM
koff
s-1
kon
M-1s-1
pHTemp
°C
Tyrosine-protein kinase JAK1
(Homo sapiens (Human))
BDBM50031754
(CHEMBL3360324)
Show SMILES COc1ccc(cc1)-c1cccc2nc(NC(C)=O)nn12
Show InChI InChI=1S/C15H14N4O2/c1-10(20)16-15-17-14-5-3-4-13(19(14)18-15)11-6-8-12(21-2)9-7-11/h3-9H,1-2H3,(H,16,18,20)
Reactome pathway
n/an/a>4.00E+3n/an/an/an/an/an/a
Galapagos NV
Curated by ChEMBL
Assay Description
Inhibition of human recombinant JAK1
J Med Chem 57: 9323-42 (2014)
Article DOI: 10.1021/jm501262q
BindingDB Entry DOI: 10.7270/Q2GH9KK6