BDBM50031758 CHEMBL3360328
SMILES: CNC(=O)Nc1nc2cccc(-c3ccc(OC)cc3)n2n1
InChI Key: InChIKey=UHXSMSKRCHMAHL-UHFFFAOYSA-N
Data: 1 IC50
Activity Spreadsheet -- Enzyme Inhibition Constant Data from BindingDB
Found 1 hit for monomerid = 50031758
Trg + Lig
Ki
nM
ΔG°
kcal/mole
IC50
nM
Kd
nM
EC50/IC50
nM
koff
s-1
kon
M-1s-1
pHTemp
°C
Tyrosine-protein kinase JAK1
(Homo sapiens (Human))
BDBM50031758
(CHEMBL3360328)
Show SMILES CNC(=O)Nc1nc2cccc(-c3ccc(OC)cc3)n2n1
Show InChI InChI=1S/C15H15N5O2/c1-16-15(21)18-14-17-13-5-3-4-12(20(13)19-14)10-6-8-11(22-2)9-7-10/h3-9H,1-2H3,(H2,16,18,19,21)
Reactome pathway
n/an/a 413n/an/an/an/an/an/a
Galapagos NV
Curated by ChEMBL
Assay Description
Inhibition of human recombinant JAK1
J Med Chem 57: 9323-42 (2014)
Article DOI: 10.1021/jm501262q
BindingDB Entry DOI: 10.7270/Q2GH9KK6