BDBM50031767 CHEMBL3360337
SMILES: O=C(Nc1nc2cccc(-c3cn[nH]c3)n2n1)C1CC1
InChI Key: InChIKey=JFJSKASPXVFXEO-UHFFFAOYSA-N
Data: 1 IC50
Activity Spreadsheet -- Enzyme Inhibition Constant Data from BindingDB
Found 1 hit for monomerid = 50031767
Trg + Lig
Ki
nM
ΔG°
kcal/mole
IC50
nM
Kd
nM
EC50/IC50
nM
koff
s-1
kon
M-1s-1
pHTemp
°C
Tyrosine-protein kinase JAK1
(Homo sapiens (Human))
BDBM50031767
(CHEMBL3360337)
Show SMILES O=C(Nc1nc2cccc(-c3cn[nH]c3)n2n1)C1CC1
Show InChI InChI=1S/C13H12N6O/c20-12(8-4-5-8)17-13-16-11-3-1-2-10(19(11)18-13)9-6-14-15-7-9/h1-3,6-8H,4-5H2,(H,14,15)(H,17,18,20)
Reactome pathway
n/an/a 1.35E+3n/an/an/an/an/an/a
Galapagos NV
Curated by ChEMBL
Assay Description
Inhibition of human recombinant JAK1
J Med Chem 57: 9323-42 (2014)
Article DOI: 10.1021/jm501262q
BindingDB Entry DOI: 10.7270/Q2GH9KK6