BDBM50031768 CHEMBL3360338
SMILES: COCc1cccc(c1)-c1cccc2nc(NC(=O)C3CC3)nn12
InChI Key: InChIKey=ZUYZYWJEYWDGSL-UHFFFAOYSA-N
Data: 1 IC50
Activity Spreadsheet -- Enzyme Inhibition Constant Data from BindingDB
Found 1 hit for monomerid = 50031768
Trg + Lig
Ki
nM
ΔG°
kcal/mole
IC50
nM
Kd
nM
EC50/IC50
nM
koff
s-1
kon
M-1s-1
pHTemp
°C
Tyrosine-protein kinase JAK1
(Homo sapiens (Human))
BDBM50031768
(CHEMBL3360338)
Show SMILES COCc1cccc(c1)-c1cccc2nc(NC(=O)C3CC3)nn12
Show InChI InChI=1S/C18H18N4O2/c1-24-11-12-4-2-5-14(10-12)15-6-3-7-16-19-18(21-22(15)16)20-17(23)13-8-9-13/h2-7,10,13H,8-9,11H2,1H3,(H,20,21,23)
Reactome pathway
n/an/a 572n/an/an/an/an/an/a
Galapagos NV
Curated by ChEMBL
Assay Description
Inhibition of human recombinant JAK1
J Med Chem 57: 9323-42 (2014)
Article DOI: 10.1021/jm501262q
BindingDB Entry DOI: 10.7270/Q2GH9KK6