BDBM50031803 CHEMBL3360340
SMILES: CC(C)(C)OCc1ccccc1-c1cccc2nc(NC(=O)C3CC3)nn12
InChI Key: InChIKey=VWNCPJLITIORKC-UHFFFAOYSA-N
Data: 1 IC50
Activity Spreadsheet -- Enzyme Inhibition Constant Data from BindingDB
Found 1 hit for monomerid = 50031803
Trg + Lig
Ki
nM
ΔG°
kcal/mole
IC50
nM
Kd
nM
EC50/IC50
nM
koff
s-1
kon
M-1s-1
pHTemp
°C
Tyrosine-protein kinase JAK1
(Homo sapiens (Human))
BDBM50031803
(CHEMBL3360340)
Show SMILES CC(C)(C)OCc1ccccc1-c1cccc2nc(NC(=O)C3CC3)nn12
Show InChI InChI=1S/C21H24N4O2/c1-21(2,3)27-13-15-7-4-5-8-16(15)17-9-6-10-18-22-20(24-25(17)18)23-19(26)14-11-12-14/h4-10,14H,11-13H2,1-3H3,(H,23,24,26)
Reactome pathway
n/an/a>1.00E+4n/an/an/an/an/an/a
Galapagos NV
Curated by ChEMBL
Assay Description
Inhibition of human recombinant JAK1
J Med Chem 57: 9323-42 (2014)
Article DOI: 10.1021/jm501262q
BindingDB Entry DOI: 10.7270/Q2GH9KK6