BDBM50032090 4-(Methyl-phenyl-amino)-2-o-tolylamino-quinazolin-6-ol::CHEMBL330247
SMILES: CN(c1ccccc1)c1nc(Nc2ccccc2C)nc2ccc(O)cc12
InChI Key: InChIKey=FPCVQBPBPHHUEX-UHFFFAOYSA-N
Data: 1 IC50
Activity Spreadsheet -- Enzyme Inhibition Constant Data from BindingDB
Found 1 hit for monomerid = 50032090
Trg + Lig
Ki
nM
ΔG°
kcal/mole
IC50
nM
Kd
nM
EC50/IC50
nM
koff
s-1
kon
M-1s-1
pHTemp
°C
Potassium-transporting ATPase
(Sus scrofa (Pig))
BDBM50032090
(4-(Methyl-phenyl-amino)-2-o-tolylamino-quinazolin-...)
Show SMILES CN(c1ccccc1)c1nc(Nc2ccccc2C)nc2ccc(O)cc12
Show InChI InChI=1S/C22H20N4O/c1-15-8-6-7-11-19(15)23-22-24-20-13-12-17(27)14-18(20)21(25-22)26(2)16-9-4-3-5-10-16/h3-14,27H,1-2H3,(H,23,24,25)
n/an/a 24n/an/an/an/an/an/a
SmithKline Beecham Pharmaceuticals R & D
Curated by ChEMBL
Assay Description
Inhibition of K+ stimulated gastric ATPase activity
J Med Chem 38: 2763-73 (1995)
BindingDB Entry DOI: 10.7270/Q2TT4Q0J