BDBM50032124 CHEMBL315880::N*4*-Methyl-N*4*-phenyl-N*2*-o-tolyl-thieno[3,2-d]pyrimidine-2,4-diamine
SMILES: CN(c1ccccc1)c1nc(Nc2ccccc2C)nc2ccsc12
InChI Key: InChIKey=HTFDXILAZBGPEJ-UHFFFAOYSA-N
Data: 1 IC50
Activity Spreadsheet -- Enzyme Inhibition Constant Data from BindingDB
Found 1 hit for monomerid = 50032124
Trg + Lig
Ki
nM
ΔG°
kcal/mole
IC50
nM
Kd
nM
EC50/IC50
nM
koff
s-1
kon
M-1s-1
pHTemp
°C
Potassium-transporting ATPase
(Sus scrofa (Pig))
BDBM50032124
(CHEMBL315880 | N*4*-Methyl-N*4*-phenyl-N*2*-o-toly...)
Show SMILES CN(c1ccccc1)c1nc(Nc2ccccc2C)nc2ccsc12
Show InChI InChI=1S/C20H18N4S/c1-14-8-6-7-11-16(14)21-20-22-17-12-13-25-18(17)19(23-20)24(2)15-9-4-3-5-10-15/h3-13H,1-2H3,(H,21,22,23)
n/an/a 19n/an/an/an/an/an/a
SmithKline Beecham Pharmaceuticals R & D
Curated by ChEMBL
Assay Description
Inhibition of K+ stimulated gastric ATPase activity
J Med Chem 38: 2763-73 (1995)
BindingDB Entry DOI: 10.7270/Q2TT4Q0J