BDBM50032237 6-Benzyl-1-(2-hydroxy-ethoxymethyl)-5-isopropyl-1H-pyrimidine-2,4-dione::CHEMBL96032
SMILES: CC(C)c1c(Cc2ccccc2)n(COCCO)c(=O)[nH]c1=O
InChI Key: InChIKey=XPEZSTNPEXHVSG-UHFFFAOYSA-N
Data: 1 EC50
Activity Spreadsheet -- Enzyme Inhibition Constant Data from BindingDB
Found 1 hit for monomerid = 50032237
Trg + Lig
Ki
nM
ΔG°
kcal/mole
IC50
nM
Kd
nM
EC50/IC50
nM
koff
s-1
kon
M-1s-1
pHTemp
°C
Human immunodeficiency virus type 1 reverse transcriptase
(Human immunodeficiency virus 1)
BDBM50032237
(6-Benzyl-1-(2-hydroxy-ethoxymethyl)-5-isopropyl-1H...)
Show SMILES CC(C)c1c(Cc2ccccc2)n(COCCO)c(=O)[nH]c1=O
Show InChI InChI=1S/C17H22N2O4/c1-12(2)15-14(10-13-6-4-3-5-7-13)19(11-23-9-8-20)17(22)18-16(15)21/h3-7,12,20H,8-11H2,1-2H3,(H,18,21,22)
n/an/an/an/a 63n/an/an/an/a
Université d'Orléans
Curated by ChEMBL
Assay Description
Inhibitory concentration against HIV-1 reverse transcriptase
J Med Chem 40: 4257-64 (1998)
Article DOI: 10.1021/jm970110p
BindingDB Entry DOI: 10.7270/Q2WS8SC3