BDBM50032664 4-[1-(3,5,5,8,8-Pentamethyl-5,6,7,8-tetrahydro-naphthalen-2-yl)-cyclopropyl]-benzoic acid::CHEMBL106896
SMILES: Cc1cc2c(cc1C1(CC1)c1ccc(cc1)C(O)=O)C(C)(C)CCC2(C)C
InChI Key: InChIKey=IQIDRTFMVGFIEL-UHFFFAOYSA-N
Data: 3 Kd  3 EC50
Activity Spreadsheet -- Enzyme Inhibition Constant Data from BindingDB
Found 6 hits for monomerid = 50032664
Trg + Lig
Ki
nM
ΔG°
kcal/mole
IC50
nM
Kd
nM
EC50/IC50
nM
koff
s-1
kon
M-1s-1
pHTemp
°C
Retinoid X receptor beta
(Mus musculus)
BDBM50032664
(4-[1-(3,5,5,8,8-Pentamethyl-5,6,7,8-tetrahydro-nap...)
Show SMILES Cc1cc2c(cc1C1(CC1)c1ccc(cc1)C(O)=O)C(C)(C)CCC2(C)C
Show InChI InChI=1S/C25H30O2/c1-16-14-20-21(24(4,5)11-10-23(20,2)3)15-19(16)25(12-13-25)18-8-6-17(7-9-18)22(26)27/h6-9,14-15H,10-13H2,1-5H3,(H,26,27)
Reactome pathway
n/an/an/an/a 22n/an/an/an/a
Ligand Pharmaceuticals, Inc.
Curated by ChEMBL
Assay Description
Ability to activate gene expression at Retinoic acid receptor RXR-beta was evaluated in a cotransfection assay.
J Med Chem 38: 3146-55 (1995)
BindingDB Entry DOI: 10.7270/Q2542MMT
Retinoic acid receptor RXR-alpha
(Homo sapiens (Human))
BDBM50032664
(4-[1-(3,5,5,8,8-Pentamethyl-5,6,7,8-tetrahydro-nap...)
Show SMILES Cc1cc2c(cc1C1(CC1)c1ccc(cc1)C(O)=O)C(C)(C)CCC2(C)C
Show InChI InChI=1S/C25H30O2/c1-16-14-20-21(24(4,5)11-10-23(20,2)3)15-19(16)25(12-13-25)18-8-6-17(7-9-18)22(26)27/h6-9,14-15H,10-13H2,1-5H3,(H,26,27)
NCI pathway
Reactome pathway
n/an/an/a 46n/an/an/an/an/a
Ligand Pharmaceuticals, Inc.
Curated by ChEMBL
Assay Description
Ability to bind directly to Retinoic acid receptor RXR-alpha was evaluated in a competitive binding assay.
J Med Chem 38: 3146-55 (1995)
BindingDB Entry DOI: 10.7270/Q2542MMT
Retinoic acid receptor RXR-alpha
(Homo sapiens (Human))
BDBM50032664
(4-[1-(3,5,5,8,8-Pentamethyl-5,6,7,8-tetrahydro-nap...)
Show SMILES Cc1cc2c(cc1C1(CC1)c1ccc(cc1)C(O)=O)C(C)(C)CCC2(C)C
Show InChI InChI=1S/C25H30O2/c1-16-14-20-21(24(4,5)11-10-23(20,2)3)15-19(16)25(12-13-25)18-8-6-17(7-9-18)22(26)27/h6-9,14-15H,10-13H2,1-5H3,(H,26,27)
NCI pathway
Reactome pathway
n/an/an/an/a 26n/an/an/an/a
Ligand Pharmaceuticals, Inc.
Curated by ChEMBL
Assay Description
Ability to activate gene expression at Retinoic acid receptor RXR-alpha was evaluated in a cotransfection assay.
J Med Chem 38: 3146-55 (1995)
BindingDB Entry DOI: 10.7270/Q2542MMT
Retinoid X receptor beta
(Mus musculus)
BDBM50032664
(4-[1-(3,5,5,8,8-Pentamethyl-5,6,7,8-tetrahydro-nap...)
Show SMILES Cc1cc2c(cc1C1(CC1)c1ccc(cc1)C(O)=O)C(C)(C)CCC2(C)C
Show InChI InChI=1S/C25H30O2/c1-16-14-20-21(24(4,5)11-10-23(20,2)3)15-19(16)25(12-13-25)18-8-6-17(7-9-18)22(26)27/h6-9,14-15H,10-13H2,1-5H3,(H,26,27)
Reactome pathway
n/an/an/a 70n/an/an/an/an/a
Ligand Pharmaceuticals, Inc.
Curated by ChEMBL
Assay Description
Binding affinity to Retinoic acid receptor RXR-beta was determined in a competitive binding assay.
J Med Chem 38: 3146-55 (1995)
BindingDB Entry DOI: 10.7270/Q2542MMT
Retinoid X receptor gamma
(Mus musculus)
BDBM50032664
(4-[1-(3,5,5,8,8-Pentamethyl-5,6,7,8-tetrahydro-nap...)
Show SMILES Cc1cc2c(cc1C1(CC1)c1ccc(cc1)C(O)=O)C(C)(C)CCC2(C)C
Show InChI InChI=1S/C25H30O2/c1-16-14-20-21(24(4,5)11-10-23(20,2)3)15-19(16)25(12-13-25)18-8-6-17(7-9-18)22(26)27/h6-9,14-15H,10-13H2,1-5H3,(H,26,27)
Reactome pathway
n/an/an/an/a 17n/an/an/an/a
Ligand Pharmaceuticals, Inc.
Curated by ChEMBL
Assay Description
Ability to activate gene expression at Retinoic acid receptor RXR-gamma was evaluated in a cotransfection assay.
J Med Chem 38: 3146-55 (1995)
BindingDB Entry DOI: 10.7270/Q2542MMT
Retinoid X receptor gamma
(Mus musculus)
BDBM50032664
(4-[1-(3,5,5,8,8-Pentamethyl-5,6,7,8-tetrahydro-nap...)
Show SMILES Cc1cc2c(cc1C1(CC1)c1ccc(cc1)C(O)=O)C(C)(C)CCC2(C)C
Show InChI InChI=1S/C25H30O2/c1-16-14-20-21(24(4,5)11-10-23(20,2)3)15-19(16)25(12-13-25)18-8-6-17(7-9-18)22(26)27/h6-9,14-15H,10-13H2,1-5H3,(H,26,27)
Reactome pathway
n/an/an/a 25n/an/an/an/an/a
Ligand Pharmaceuticals, Inc.
Curated by ChEMBL
Assay Description
Binding affinity to Retinoic acid receptor RXR-gamma was evaluated in a competitive binding assay.
J Med Chem 38: 3146-55 (1995)
BindingDB Entry DOI: 10.7270/Q2542MMT