BDBM50032909 CHEMBL1361770
SMILES: COc1cccc(c1)C(=O)Nc1cc2n(C)c(=O)n(C)c2cc1N1CCOCC1
InChI Key: InChIKey=UUHIXEAOPRINGQ-UHFFFAOYSA-N
Data: 2 IC50
Activity Spreadsheet -- Enzyme Inhibition Constant Data from BindingDB
Found 2 hits for monomerid = 50032909
Trg + Lig
Ki
nM
ΔG°
kcal/mole
IC50
nM
Kd
nM
EC50/IC50
nM
koff
s-1
kon
M-1s-1
pHTemp
°C
Bromodomain-containing protein 4
(Homo sapiens (Human))
BDBM50032909
(CHEMBL1361770)
Show SMILES COc1cccc(c1)C(=O)Nc1cc2n(C)c(=O)n(C)c2cc1N1CCOCC1
Show InChI InChI=1S/C21H24N4O4/c1-23-18-12-16(22-20(26)14-5-4-6-15(11-14)28-3)17(25-7-9-29-10-8-25)13-19(18)24(2)21(23)27/h4-6,11-13H,7-10H2,1-3H3,(H,22,26)
n/an/a<5.01E+4n/an/an/an/an/an/a
GlaxoSmithKline
Curated by ChEMBL
Assay Description
Binding affinity to 6His-tagged-BRD4 BD1 Y390A mutant (1 to 477 aa) (unknown origin) by TR-FRET competitive assay
ACS Med Chem Lett 5: 1190-5 (2014)
Article DOI: 10.1021/ml5002932
BindingDB Entry DOI: 10.7270/Q2445P29
Peregrin
(Homo sapiens (Human))
BDBM50032909
(CHEMBL1361770)
Show SMILES COc1cccc(c1)C(=O)Nc1cc2n(C)c(=O)n(C)c2cc1N1CCOCC1
Show InChI InChI=1S/C21H24N4O4/c1-23-18-12-16(22-20(26)14-5-4-6-15(11-14)28-3)17(25-7-9-29-10-8-25)13-19(18)24(2)21(23)27/h4-6,11-13H,7-10H2,1-3H3,(H,22,26)
n/an/a 631n/an/an/an/an/an/a
GlaxoSmithKline
Curated by ChEMBL
Assay Description
Binding affinity to 6H-Flag-tagged Tev-BRPF1 (622-738 aa) (unknown origin) by TR-FRET competitive assay
ACS Med Chem Lett 5: 1190-5 (2014)
Article DOI: 10.1021/ml5002932
BindingDB Entry DOI: 10.7270/Q2445P29