BDBM50032910 CHEMBL3356147
SMILES: COc1cccc(c1)C(=O)Nc1cc2n(C)c(=O)n(C)c2cc1C
InChI Key: InChIKey=NTUNQIAPYGHURV-UHFFFAOYSA-N
Data: 2 IC50
Activity Spreadsheet -- Enzyme Inhibition Constant Data from BindingDB
Found 2 hits for monomerid = 50032910
Trg + Lig
Ki
nM
ΔG°
kcal/mole
IC50
nM
Kd
nM
EC50/IC50
nM
koff
s-1
kon
M-1s-1
pHTemp
°C
Bromodomain-containing protein 4
(Homo sapiens (Human))
BDBM50032910
(CHEMBL3356147)
Show SMILES COc1cccc(c1)C(=O)Nc1cc2n(C)c(=O)n(C)c2cc1C
Show InChI InChI=1S/C18H19N3O3/c1-11-8-15-16(21(3)18(23)20(15)2)10-14(11)19-17(22)12-6-5-7-13(9-12)24-4/h5-10H,1-4H3,(H,19,22)
n/an/a<5.01E+4n/an/an/an/an/an/a
GlaxoSmithKline
Curated by ChEMBL
Assay Description
Binding affinity to 6His-tagged-BRD4 BD1 Y390A mutant (1 to 477 aa) (unknown origin) by TR-FRET competitive assay
ACS Med Chem Lett 5: 1190-5 (2014)
Article DOI: 10.1021/ml5002932
BindingDB Entry DOI: 10.7270/Q2445P29
Peregrin
(Homo sapiens (Human))
BDBM50032910
(CHEMBL3356147)
Show SMILES COc1cccc(c1)C(=O)Nc1cc2n(C)c(=O)n(C)c2cc1C
Show InChI InChI=1S/C18H19N3O3/c1-11-8-15-16(21(3)18(23)20(15)2)10-14(11)19-17(22)12-6-5-7-13(9-12)24-4/h5-10H,1-4H3,(H,19,22)
n/an/a 3.16E+3n/an/an/an/an/an/a
GlaxoSmithKline
Curated by ChEMBL
Assay Description
Binding affinity to 6H-Flag-tagged Tev-BRPF1 (622-738 aa) (unknown origin) by TR-FRET competitive assay
ACS Med Chem Lett 5: 1190-5 (2014)
Article DOI: 10.1021/ml5002932
BindingDB Entry DOI: 10.7270/Q2445P29