BDBM50032921 CHEMBL1444120
SMILES: Cc1ccc(c(C)c1)S(=O)(=O)Nc1ccc2n(C)c(=O)n(C)c2c1
InChI Key: InChIKey=HVGVNYJRZJHYBS-UHFFFAOYSA-N
Data: 3 IC50
Activity Spreadsheet -- Enzyme Inhibition Constant Data from BindingDB
Found 3 hits for monomerid = 50032921
Trg + Lig
Ki
nM
ΔG°
kcal/mole
IC50
nM
Kd
nM
EC50/IC50
nM
koff
s-1
kon
M-1s-1
pHTemp
°C
Bromodomain-containing protein 4
(Homo sapiens (Human))
BDBM50032921
(CHEMBL1444120)
Show SMILES Cc1ccc(c(C)c1)S(=O)(=O)Nc1ccc2n(C)c(=O)n(C)c2c1
Show InChI InChI=1S/C17H19N3O3S/c1-11-5-8-16(12(2)9-11)24(22,23)18-13-6-7-14-15(10-13)20(4)17(21)19(14)3/h5-10,18H,1-4H3
n/an/a 2.51E+3n/an/an/an/an/an/a
GlaxoSmithKline
Curated by ChEMBL
Assay Description
Binding affinity to 6His-tagged-BRD4 BD1 Y390A mutant (1 to 477 aa) (unknown origin) by TR-FRET competitive assay
ACS Med Chem Lett 5: 1190-5 (2014)
Article DOI: 10.1021/ml5002932
BindingDB Entry DOI: 10.7270/Q2445P29
Bromodomain-containing protein 4
(Homo sapiens (Human))
BDBM50032921
(CHEMBL1444120)
Show SMILES Cc1ccc(c(C)c1)S(=O)(=O)Nc1ccc2n(C)c(=O)n(C)c2c1
Show InChI InChI=1S/C17H19N3O3S/c1-11-5-8-16(12(2)9-11)24(22,23)18-13-6-7-14-15(10-13)20(4)17(21)19(14)3/h5-10,18H,1-4H3
n/an/a 2.50E+3n/an/an/an/an/an/a
Bienta/Enamine Ltd.
Curated by ChEMBL
Assay Description
Inhibition of recombinant human N-terminal His6-tagged BRD4 by TR-FRET assay
Bioorg Med Chem 26: 3399-3405 (2018)
Article DOI: 10.1016/j.bmc.2018.05.010
BindingDB Entry DOI: 10.7270/Q2H70J9B
Peregrin
(Homo sapiens (Human))
BDBM50032921
(CHEMBL1444120)
Show SMILES Cc1ccc(c(C)c1)S(=O)(=O)Nc1ccc2n(C)c(=O)n(C)c2c1
Show InChI InChI=1S/C17H19N3O3S/c1-11-5-8-16(12(2)9-11)24(22,23)18-13-6-7-14-15(10-13)20(4)17(21)19(14)3/h5-10,18H,1-4H3
n/an/a 200n/an/an/an/an/an/a
GlaxoSmithKline
Curated by ChEMBL
Assay Description
Binding affinity to 6H-Flag-tagged Tev-BRPF1 (622-738 aa) (unknown origin) by TR-FRET competitive assay
ACS Med Chem Lett 5: 1190-5 (2014)
Article DOI: 10.1021/ml5002932
BindingDB Entry DOI: 10.7270/Q2445P29