BDBM50032926 CHEMBL1702128
SMILES: COc1ccccc1C(=O)Nc1ccc2n(C)c(=O)n(C)c2c1
InChI Key: InChIKey=NRAOIQWWRCGIDB-UHFFFAOYSA-N
Data: 2 IC50
Activity Spreadsheet -- Enzyme Inhibition Constant Data from BindingDB
Found 2 hits for monomerid = 50032926
Trg + Lig
Ki
nM
ΔG°
kcal/mole
IC50
nM
Kd
nM
EC50/IC50
nM
koff
s-1
kon
M-1s-1
pHTemp
°C
Peregrin
(Homo sapiens (Human))
BDBM50032926
(CHEMBL1702128)
Show SMILES COc1ccccc1C(=O)Nc1ccc2n(C)c(=O)n(C)c2c1
Show InChI InChI=1S/C17H17N3O3/c1-19-13-9-8-11(10-14(13)20(2)17(19)22)18-16(21)12-6-4-5-7-15(12)23-3/h4-10H,1-3H3,(H,18,21)
n/an/a 2.51E+3n/an/an/an/an/an/a
GlaxoSmithKline
Curated by ChEMBL
Assay Description
Binding affinity to 6H-Flag-tagged Tev-BRPF1 (622-738 aa) (unknown origin) by TR-FRET competitive assay
ACS Med Chem Lett 5: 1190-5 (2014)
Article DOI: 10.1021/ml5002932
BindingDB Entry DOI: 10.7270/Q2445P29
Bromodomain-containing protein 4
(Homo sapiens (Human))
BDBM50032926
(CHEMBL1702128)
Show SMILES COc1ccccc1C(=O)Nc1ccc2n(C)c(=O)n(C)c2c1
Show InChI InChI=1S/C17H17N3O3/c1-19-13-9-8-11(10-14(13)20(2)17(19)22)18-16(21)12-6-4-5-7-15(12)23-3/h4-10H,1-3H3,(H,18,21)
n/an/a<5.01E+4n/an/an/an/an/an/a
GlaxoSmithKline
Curated by ChEMBL
Assay Description
Binding affinity to 6His-tagged-BRD4 BD1 Y390A mutant (1 to 477 aa) (unknown origin) by TR-FRET competitive assay
ACS Med Chem Lett 5: 1190-5 (2014)
Article DOI: 10.1021/ml5002932
BindingDB Entry DOI: 10.7270/Q2445P29