BDBM50033120 CHEMBL3357061
SMILES: CN(C)c1nc(nc2N(CCCN3CCCC3)CCc12)-c1ccc(cc1)N1CCN(C)CC1
InChI Key: InChIKey=ZGLMJLLRDSNQRE-UHFFFAOYSA-N
Data: 1 IC50
Activity Spreadsheet -- Enzyme Inhibition Constant Data from BindingDB
Found 1 hit for monomerid = 50033120
Trg + Lig
Ki
nM
ΔG°
kcal/mole
IC50
nM
Kd
nM
EC50/IC50
nM
koff
s-1
kon
M-1s-1
pHTemp
°C
Toll-like receptor 9
(Homo sapiens (Human))
BDBM50033120
(CHEMBL3357061)
Show SMILES CN(C)c1nc(nc2N(CCCN3CCCC3)CCc12)-c1ccc(cc1)N1CCN(C)CC1
Show InChI InChI=1S/C26H39N7/c1-29(2)25-23-11-16-33(15-6-14-31-12-4-5-13-31)26(23)28-24(27-25)21-7-9-22(10-8-21)32-19-17-30(3)18-20-32/h7-10H,4-6,11-20H2,1-3H3
n/an/a 73n/an/an/an/an/an/a
Sumitomo Dainippon Pharma Co., Ltd.
Curated by ChEMBL
Assay Description
Antagonist activity at human TLR9 transfected in HEK293 cells after 6 hrs by NF-kappaB luciferase reporter assay
ACS Med Chem Lett 5: 1235-9 (2014)
Article DOI: 10.1021/ml5003184
BindingDB Entry DOI: 10.7270/Q2M32XBN