BDBM50033132 CHEMBL3356615
SMILES: CN1CCN(CC1)c1ccc(cc1)-c1nc2N(CCN3CCOCC3)CCc2c(C)n1
InChI Key: InChIKey=UWHNAAGVKKICST-UHFFFAOYSA-N
Data: 1 IC50
Activity Spreadsheet -- Enzyme Inhibition Constant Data from BindingDB
Found 1 hit for monomerid = 50033132
Trg + Lig
Ki
nM
ΔG°
kcal/mole
IC50
nM
Kd
nM
EC50/IC50
nM
koff
s-1
kon
M-1s-1
pHTemp
°C
Toll-like receptor 9
(Homo sapiens (Human))
BDBM50033132
(CHEMBL3356615)
Show SMILES CN1CCN(CC1)c1ccc(cc1)-c1nc2N(CCN3CCOCC3)CCc2c(C)n1
Show InChI InChI=1S/C24H34N6O/c1-19-22-7-8-30(14-11-28-15-17-31-18-16-28)24(22)26-23(25-19)20-3-5-21(6-4-20)29-12-9-27(2)10-13-29/h3-6H,7-18H2,1-2H3
n/an/a 20n/an/an/an/an/an/a
Sumitomo Dainippon Pharma Co., Ltd.
Curated by ChEMBL
Assay Description
Antagonist activity at human TLR9 transfected in HEK293 cells after 6 hrs by NF-kappaB luciferase reporter assay
ACS Med Chem Lett 5: 1235-9 (2014)
Article DOI: 10.1021/ml5003184
BindingDB Entry DOI: 10.7270/Q2M32XBN