BDBM50033137 CHEMBL2311022::H-Tyr-Gly-Gly-Phe-Leu-Arg-Arg-Ile-Arg-Pro-Lys-Leu-Lys-Trp-Asp-Asn-Gln-OH
SMILES: [#6]-[#6]-[#6@H](-[#6])-[#6@H](-[#7]-[#6](=O)-[#6@H](-[#6]-[#6]-[#6]\[#7]=[#6](\[#7])-[#7])-[#7]-[#6](=O)-[#6@H](-[#6]-[#6]-[#6]\[#7]=[#6](\[#7])-[#7])-[#7]-[#6](=O)-[#6@H](-[#6]-[#6](-[#6])-[#6])-[#7]-[#6](=O)-[#6@H](-[#6]-c1ccccc1)-[#7]-[#6]-[#6]-[#7]-[#6](=O)-[#6]-[#7]-[#6](=O)-[#6@@H](-[#7])-[#6]-c1ccc(-[#8])cc1)-[#6](=O)-[#7]-[#6@@H](-[#6]-[#6]-[#6]\[#7]=[#6](\[#7])-[#7])-[#6](=O)-[#7]-1-[#6]-[#6]-[#6]-[#6@H]-1-[#6](=O)-[#7]-[#6@@H](-[#6]-[#6]-[#6]-[#6]-[#7])-[#6](-[#7])=O
InChI Key: InChIKey=ZIIJZNDBDMLLKR-KMEINJDZSA-N
Data: 3 IC50
Activity Spreadsheet -- Enzyme Inhibition Constant Data from BindingDB
Found 3 hits for monomerid = 50033137
Trg + Lig
Ki
nM
ΔG°
kcal/mole
IC50
nM
Kd
nM
EC50/IC50
nM
koff
s-1
kon
M-1s-1
pHTemp
°C
Mu-type opioid receptor
(GUINEA PIG)
BDBM50033137
(CHEMBL2311022 | H-Tyr-Gly-Gly-Phe-Leu-Arg-Arg-Ile-...)
Show SMILES [#6]-[#6]-[#6@H](-[#6])-[#6@H](-[#7]-[#6](=O)-[#6@H](-[#6]-[#6]-[#6]\[#7]=[#6](\[#7])-[#7])-[#7]-[#6](=O)-[#6@H](-[#6]-[#6]-[#6]\[#7]=[#6](\[#7])-[#7])-[#7]-[#6](=O)-[#6@H](-[#6]-[#6](-[#6])-[#6])-[#7]-[#6](=O)-[#6@H](-[#6]-c1ccccc1)-[#7]-[#6]-[#6]-[#7]-[#6](=O)-[#6]-[#7]-[#6](=O)-[#6@@H](-[#7])-[#6]-c1ccc(-[#8])cc1)-[#6](=O)-[#7]-[#6@@H](-[#6]-[#6]-[#6]\[#7]=[#6](\[#7])-[#7])-[#6](=O)-[#7]-1-[#6]-[#6]-[#6]-[#6@H]-1-[#6](=O)-[#7]-[#6@@H](-[#6]-[#6]-[#6]-[#6]-[#7])-[#6](-[#7])=O |r|
Show InChI InChI=1S/C63H106N22O11/c1-5-38(4)51(59(95)82-46(20-13-29-77-63(71)72)60(96)85-32-14-21-49(85)58(94)79-43(52(66)88)17-9-10-26-64)84-55(91)45(19-12-28-76-62(69)70)80-54(90)44(18-11-27-75-61(67)68)81-57(93)48(33-37(2)3)83-56(92)47(35-39-15-7-6-8-16-39)73-30-31-74-50(87)36-78-53(89)42(65)34-40-22-24-41(86)25-23-40/h6-8,15-16,22-25,37-38,42-49,51,73,86H,5,9-14,17-21,26-36,64-65H2,1-4H3,(H2,66,88)(H,74,87)(H,78,89)(H,79,94)(H,80,90)(H,81,93)(H,82,95)(H,83,92)(H,84,91)(H4,67,68,75)(H4,69,70,76)(H4,71,72,77)/t38-,42-,43-,44-,45-,46-,47-,48-,49-,51-/m0/s1
n/an/a 1.04E+3n/an/an/an/an/an/a
University of Arizona
Curated by ChEMBL
Assay Description
Binding affinity against Opioid receptor mu 1 from Guinea pig brain homogenate using [3H]-DAMGO
J Med Chem 38: 3462-8 (1995)
BindingDB Entry DOI: 10.7270/Q2QZ291Q
Kappa-type opioid receptor
(Cavia porcellus (domestic guinea pig))
BDBM50033137
(CHEMBL2311022 | H-Tyr-Gly-Gly-Phe-Leu-Arg-Arg-Ile-...)
Show SMILES [#6]-[#6]-[#6@H](-[#6])-[#6@H](-[#7]-[#6](=O)-[#6@H](-[#6]-[#6]-[#6]\[#7]=[#6](\[#7])-[#7])-[#7]-[#6](=O)-[#6@H](-[#6]-[#6]-[#6]\[#7]=[#6](\[#7])-[#7])-[#7]-[#6](=O)-[#6@H](-[#6]-[#6](-[#6])-[#6])-[#7]-[#6](=O)-[#6@H](-[#6]-c1ccccc1)-[#7]-[#6]-[#6]-[#7]-[#6](=O)-[#6]-[#7]-[#6](=O)-[#6@@H](-[#7])-[#6]-c1ccc(-[#8])cc1)-[#6](=O)-[#7]-[#6@@H](-[#6]-[#6]-[#6]\[#7]=[#6](\[#7])-[#7])-[#6](=O)-[#7]-1-[#6]-[#6]-[#6]-[#6@H]-1-[#6](=O)-[#7]-[#6@@H](-[#6]-[#6]-[#6]-[#6]-[#7])-[#6](-[#7])=O |r|
Show InChI InChI=1S/C63H106N22O11/c1-5-38(4)51(59(95)82-46(20-13-29-77-63(71)72)60(96)85-32-14-21-49(85)58(94)79-43(52(66)88)17-9-10-26-64)84-55(91)45(19-12-28-76-62(69)70)80-54(90)44(18-11-27-75-61(67)68)81-57(93)48(33-37(2)3)83-56(92)47(35-39-15-7-6-8-16-39)73-30-31-74-50(87)36-78-53(89)42(65)34-40-22-24-41(86)25-23-40/h6-8,15-16,22-25,37-38,42-49,51,73,86H,5,9-14,17-21,26-36,64-65H2,1-4H3,(H2,66,88)(H,74,87)(H,78,89)(H,79,94)(H,80,90)(H,81,93)(H,82,95)(H,83,92)(H,84,91)(H4,67,68,75)(H4,69,70,76)(H4,71,72,77)/t38-,42-,43-,44-,45-,46-,47-,48-,49-,51-/m0/s1
n/an/a 0.580n/an/an/an/an/an/a
University of Arizona
Curated by ChEMBL
Assay Description
Binding affinity against Opioid receptor kappa 1 of Guinea pig brain homogenate using [3H]U-69,593
J Med Chem 38: 3462-8 (1995)
BindingDB Entry DOI: 10.7270/Q2QZ291Q
Delta-type opioid receptor
(Homo sapiens (Human))
BDBM50033137
(CHEMBL2311022 | H-Tyr-Gly-Gly-Phe-Leu-Arg-Arg-Ile-...)
Show SMILES [#6]-[#6]-[#6@H](-[#6])-[#6@H](-[#7]-[#6](=O)-[#6@H](-[#6]-[#6]-[#6]\[#7]=[#6](\[#7])-[#7])-[#7]-[#6](=O)-[#6@H](-[#6]-[#6]-[#6]\[#7]=[#6](\[#7])-[#7])-[#7]-[#6](=O)-[#6@H](-[#6]-[#6](-[#6])-[#6])-[#7]-[#6](=O)-[#6@H](-[#6]-c1ccccc1)-[#7]-[#6]-[#6]-[#7]-[#6](=O)-[#6]-[#7]-[#6](=O)-[#6@@H](-[#7])-[#6]-c1ccc(-[#8])cc1)-[#6](=O)-[#7]-[#6@@H](-[#6]-[#6]-[#6]\[#7]=[#6](\[#7])-[#7])-[#6](=O)-[#7]-1-[#6]-[#6]-[#6]-[#6@H]-1-[#6](=O)-[#7]-[#6@@H](-[#6]-[#6]-[#6]-[#6]-[#7])-[#6](-[#7])=O |r|
Show InChI InChI=1S/C63H106N22O11/c1-5-38(4)51(59(95)82-46(20-13-29-77-63(71)72)60(96)85-32-14-21-49(85)58(94)79-43(52(66)88)17-9-10-26-64)84-55(91)45(19-12-28-76-62(69)70)80-54(90)44(18-11-27-75-61(67)68)81-57(93)48(33-37(2)3)83-56(92)47(35-39-15-7-6-8-16-39)73-30-31-74-50(87)36-78-53(89)42(65)34-40-22-24-41(86)25-23-40/h6-8,15-16,22-25,37-38,42-49,51,73,86H,5,9-14,17-21,26-36,64-65H2,1-4H3,(H2,66,88)(H,74,87)(H,78,89)(H,79,94)(H,80,90)(H,81,93)(H,82,95)(H,83,92)(H,84,91)(H4,67,68,75)(H4,69,70,76)(H4,71,72,77)/t38-,42-,43-,44-,45-,46-,47-,48-,49-,51-/m0/s1
Reactome pathway
n/an/a 8.00E+3n/an/an/an/an/an/a
University of Arizona
Curated by ChEMBL
Assay Description
Binding affinity against delta opioid receptor of Guinea pig brain homogenate using [3H]c[D-Pen2,p-Cl-Phe4,D-Pen5]enkephalin
J Med Chem 38: 3462-8 (1995)
BindingDB Entry DOI: 10.7270/Q2QZ291Q