BDBM50033379 CHEMBL3357645
SMILES: F\C(=C/CN1CCCCC1)C(=O)Nc1cc2c(Nc3ccc(F)c(Cl)c3)ncnc2cc1O[C@H]1CCOC1
InChI Key: InChIKey=RFXHNJBBKBSDIB-GRKMDYAMSA-N
Data: 2 IC50
Activity Spreadsheet -- Enzyme Inhibition Constant Data from BindingDB
Found 2 hits for monomerid = 50033379
Trg + Lig
Ki
nM
ΔG°
kcal/mole
IC50
nM
Kd
nM
EC50/IC50
nM
koff
s-1
kon
M-1s-1
pHTemp
°C
Epidermal growth factor receptor
(Homo sapiens (Human))
BDBM50033379
(CHEMBL3357645)
Show SMILES F\C(=C/CN1CCCCC1)C(=O)Nc1cc2c(Nc3ccc(F)c(Cl)c3)ncnc2cc1O[C@H]1CCOC1 |r|
Show InChI InChI=1S/C27H28ClF2N5O3/c28-20-12-17(4-5-21(20)29)33-26-19-13-24(34-27(36)22(30)6-10-35-8-2-1-3-9-35)25(14-23(19)31-16-32-26)38-18-7-11-37-15-18/h4-6,12-14,16,18H,1-3,7-11,15H2,(H,34,36)(H,31,32,33)/b22-6-/t18-/m0/s1
n/an/a 2.60n/an/an/an/an/an/a
Zhejiang University
Curated by ChEMBL
Assay Description
Inhibition of wild type EGFR (unknown origin) incubated for 5 mins by HTRF assay
J Med Chem 57: 9889-900 (2014)
Article DOI: 10.1021/jm5014659
BindingDB Entry DOI: 10.7270/Q26W9CPC
Epidermal growth factor receptor
(Homo sapiens (Human))
BDBM50033379
(CHEMBL3357645)
Show SMILES F\C(=C/CN1CCCCC1)C(=O)Nc1cc2c(Nc3ccc(F)c(Cl)c3)ncnc2cc1O[C@H]1CCOC1 |r|
Show InChI InChI=1S/C27H28ClF2N5O3/c28-20-12-17(4-5-21(20)29)33-26-19-13-24(34-27(36)22(30)6-10-35-8-2-1-3-9-35)25(14-23(19)31-16-32-26)38-18-7-11-37-15-18/h4-6,12-14,16,18H,1-3,7-11,15H2,(H,34,36)(H,31,32,33)/b22-6-/t18-/m0/s1
n/an/a 16n/an/an/an/an/an/a
Zhejiang University
Curated by ChEMBL
Assay Description
Inhibition of wild type EGFR T790M mutant (unknown origin) incubated for 5 mins by HTRF assay
J Med Chem 57: 9889-900 (2014)
Article DOI: 10.1021/jm5014659
BindingDB Entry DOI: 10.7270/Q26W9CPC