BDBM50033451 1-[(S)-[(S)-2-((S)-2-{(S)-2-[(2-Benzyl-3-phenyl-propionyl)-methyl-amino]-3-methyl-butyrylamino}-3-methyl-butyrylamino)-4-oxo-4-pyrrolidin-1-yl-butyrylamino]-((S)-1-hydroxymethyl-3,3-dimethyl-butylcarbamoyl)-methyl]-cyclopentanecarboxylic acid::CHEMBL263789
SMILES: CC(C)[C@H](NC(=O)[C@H](C(C)C)N(C)C(=O)C(Cc1ccccc1)Cc1ccccc1)C(=O)N[C@@H](CC(=O)N1CCCC1)C(=O)N[C@H](C(=O)N[C@H](CO)CC(C)(C)C)C1(CCCC1)C(O)=O
InChI Key: InChIKey=PBZHRMNGSATUKR-QULKDTNDSA-N
Data: 2 EC50
Activity Spreadsheet -- Enzyme Inhibition Constant Data from BindingDB
Found 2 hits for monomerid = 50033451
Trg + Lig
Ki
nM
ΔG°
kcal/mole
IC50
nM
Kd
nM
EC50/IC50
nM
koff
s-1
kon
M-1s-1
pHTemp
°C
RRM1/RRM2 holoenzyme
(Homo sapiens (Human))
BDBM50033451
(1-[(S)-[(S)-2-((S)-2-{(S)-2-[(2-Benzyl-3-phenyl-pr...)
Show SMILES CC(C)[C@H](NC(=O)[C@H](C(C)C)N(C)C(=O)C(Cc1ccccc1)Cc1ccccc1)C(=O)N[C@@H](CC(=O)N1CCCC1)C(=O)N[C@H](C(=O)N[C@H](CO)CC(C)(C)C)C1(CCCC1)C(O)=O
Show InChI InChI=1S/C50H74N6O9/c1-32(2)40(53-45(61)41(33(3)4)55(8)47(63)36(27-34-19-11-9-12-20-34)28-35-21-13-10-14-22-35)44(60)52-38(29-39(58)56-25-17-18-26-56)43(59)54-42(50(48(64)65)23-15-16-24-50)46(62)51-37(31-57)30-49(5,6)7/h9-14,19-22,32-33,36-38,40-42,57H,15-18,23-31H2,1-8H3,(H,51,62)(H,52,60)(H,53,61)(H,54,59)(H,64,65)/t37-,38-,40-,41-,42+/m0/s1
Reactome pathway
n/an/an/an/a 6.50E+3n/an/an/an/a
Bio-M£ga/Boehringer Ingelheim Research Inc.
Curated by ChEMBL
Assay Description
Inhibitory activity against HSV-2 in baby hamster kidney cell
J Med Chem 38: 3617-23 (1995)
BindingDB Entry DOI: 10.7270/Q21V5FMW
RRM1/RRM2 holoenzyme
(Homo sapiens (Human))
BDBM50033451
(1-[(S)-[(S)-2-((S)-2-{(S)-2-[(2-Benzyl-3-phenyl-pr...)
Show SMILES CC(C)[C@H](NC(=O)[C@H](C(C)C)N(C)C(=O)C(Cc1ccccc1)Cc1ccccc1)C(=O)N[C@@H](CC(=O)N1CCCC1)C(=O)N[C@H](C(=O)N[C@H](CO)CC(C)(C)C)C1(CCCC1)C(O)=O
Show InChI InChI=1S/C50H74N6O9/c1-32(2)40(53-45(61)41(33(3)4)55(8)47(63)36(27-34-19-11-9-12-20-34)28-35-21-13-10-14-22-35)44(60)52-38(29-39(58)56-25-17-18-26-56)43(59)54-42(50(48(64)65)23-15-16-24-50)46(62)51-37(31-57)30-49(5,6)7/h9-14,19-22,32-33,36-38,40-42,57H,15-18,23-31H2,1-8H3,(H,51,62)(H,52,60)(H,53,61)(H,54,59)(H,64,65)/t37-,38-,40-,41-,42+/m0/s1
Reactome pathway
n/an/an/an/a 7.00E+3n/an/an/an/a
Bio-M£ga/Boehringer Ingelheim Research Inc.
Curated by ChEMBL
Assay Description
Inhibitory activity against HSV-1 in baby hamster kidney cell
J Med Chem 38: 3617-23 (1995)
BindingDB Entry DOI: 10.7270/Q21V5FMW