null
SMILES: [O-]C(=O)C(F)(F)F.COC1=CC(=O)N([C@H]1Cc1c[nH]c2ccccc12)C(=O)\C=C\[C@H](C)NC(=O)[C@H](CC(C)C)NC(=O)[C@H](CC(C)C)NC(=O)[C@H](C(C)C)[NH+](C)C
InChI Key:
Activity Spreadsheet -- Enzyme Inhibition Constant Data from BindingDB
Found 1 hit for monomerid = 50033627
Trg + Lig
Ki
nM
ΔG°
kcal/mole
IC50
nM
Kd
nM
EC50/IC50
nM
koff
s-1
kon
M-1s-1
pHTemp
°C
Falcipain 2
(Plasmodium falciparum)
BDBM50033627
(CHEMBL3358143)
Show SMILES [O-]C(=O)C(F)(F)F.COC1=CC(=O)N([C@H]1Cc1c[nH]c2ccccc12)C(=O)\C=C\[C@H](C)NC(=O)[C@H](CC(C)C)NC(=O)[C@H](CC(C)C)NC(=O)[C@H](C(C)C)[NH+](C)C |r,t:8|
n/an/a 12n/an/an/an/an/an/a
The University of Sydney
Curated by ChEMBL
Assay Description
Inhibition of Plasmodium falciparum FP2 using Z-Phe-Arg-AMC as substrate incubated for 30 mins prior to substrate addition measured after 30 mins by ...
J Med Chem 57: 10557-63 (2014)
Article DOI: 10.1021/jm501439w
BindingDB Entry DOI: 10.7270/Q2TM7CQW