BDBM50033941 5-Methyl-1-[4-(3-trifluoromethyl-phenyl)-thiazol-2-yl]-1H-pyrazole-4-carboxylic acid (3-hydroxy-propyl)-amide::CHEMBL9453
SMILES: Cc1c(cnn1-c1nc(cs1)-c1cccc(c1)C(F)(F)F)C(=O)NCCCO
InChI Key: InChIKey=HOFGTYCLOKDAES-UHFFFAOYSA-N
Data: 2 IC50
Activity Spreadsheet -- Enzyme Inhibition Constant Data from BindingDB
Found 2 hits for monomerid = 50033941
Trg + Lig
Ki
nM
ΔG°
kcal/mole
IC50
nM
Kd
nM
EC50/IC50
nM
koff
s-1
kon
M-1s-1
pHTemp
°C
Integrin alpha-L/beta-2
(Homo sapiens (Human))
BDBM50033941
(5-Methyl-1-[4-(3-trifluoromethyl-phenyl)-thiazol-2...)
Show SMILES Cc1c(cnn1-c1nc(cs1)-c1cccc(c1)C(F)(F)F)C(=O)NCCCO
Show InChI InChI=1S/C18H17F3N4O2S/c1-11-14(16(27)22-6-3-7-26)9-23-25(11)17-24-15(10-28-17)12-4-2-5-13(8-12)18(19,20)21/h2,4-5,8-10,26H,3,6-7H2,1H3,(H,22,27)
n/an/a 5.00E+3n/an/an/an/an/an/a
R.W. Johnson Pharmaceutical Research Institute
Curated by ChEMBL
Assay Description
Inhibition of LFA-1 mediated HL60 cell adhesion to ICAM-1
J Med Chem 38: 1057-9 (1995)
BindingDB Entry DOI: 10.7270/Q2DJ5DPP
Integrin alpha-L/beta-2
(Homo sapiens (Human))
BDBM50033941
(5-Methyl-1-[4-(3-trifluoromethyl-phenyl)-thiazol-2...)
Show SMILES Cc1c(cnn1-c1nc(cs1)-c1cccc(c1)C(F)(F)F)C(=O)NCCCO
Show InChI InChI=1S/C18H17F3N4O2S/c1-11-14(16(27)22-6-3-7-26)9-23-25(11)17-24-15(10-28-17)12-4-2-5-13(8-12)18(19,20)21/h2,4-5,8-10,26H,3,6-7H2,1H3,(H,22,27)
n/an/a 5.00E+3n/an/an/an/an/an/a
R.W. Johnson Pharmaceutical Research Institute
Curated by ChEMBL
Assay Description
Inhibition of HL-60 cell adhesion to purified ICAM-1 by LFA-1
J Med Chem 38: 1057-9 (1995)
BindingDB Entry DOI: 10.7270/Q2DJ5DPP